BDBM50222678 4-bromo-5-(2-chlorobenzamido)-N-(2-(1'-methyl-1,4'-bipiperidin-4-yl)ethyl)-1Hpyrazole-3-carboxamide::CHEMBL397248
SMILES: CN1CCC(CC1)N1CCC(CCNC(=O)c2n[nH]c(NC(=O)c3ccccc3Cl)c2Br)CC1
InChI Key: InChIKey=NCJLGLYHCSXTFV-UHFFFAOYSA-N
Data: 1 IC50
Activity Spreadsheet -- Enzyme Inhibition Constant Data from BindingDB
Found 1 hit for monomerid = 50222678
Trg + Lig
Ki
nM
ΔG°
kcal/mole
IC50
nM
Kd
nM
EC50/IC50
nM
koff
s-1
kon
M-1s-1
pHTemp
°C
Bradykinin B1 receptor
(Homo sapiens (Human))
BDBM50222678
(4-bromo-5-(2-chlorobenzamido)-N-(2-(1'-methyl-1,4'...)
Show SMILES CN1CCC(CC1)N1CCC(CCNC(=O)c2n[nH]c(NC(=O)c3ccccc3Cl)c2Br)CC1
Show InChI InChI=1S/C24H32BrClN6O2/c1-31-12-9-17(10-13-31)32-14-7-16(8-15-32)6-11-27-24(34)21-20(25)22(30-29-21)28-23(33)18-4-2-3-5-19(18)26/h2-5,16-17H,6-15H2,1H3,(H,27,34)(H2,28,29,30,33)
n/an/a 1.80n/an/an/an/an/an/a
Elan Pharmaceuticals, Inc.
Curated by ChEMBL
Assay Description
Antagonist activity at human bradykinin B1 receptor in IL1beta stimulated IMR90 cells by FLIPR assay
J Med Chem 50: 5161-7 (2007)
Article DOI: 10.1021/jm051292n
BindingDB Entry DOI: 10.7270/Q2G73DF9