BDBM50222730 CHEMBL393464::cyclo(-L-Am7(S2Py)-L-2MePhe-L-Ala-D-Pro-)
SMILES: C[C@@H]1NC(=O)[C@](C)(Cc2ccccc2)NC(=O)[C@H](CCCCCSSc2ccccn2)NC(=O)[C@H]2CCCN2C1=O
InChI Key: InChIKey=ITTWBEZYTYPCGB-GAOIQBMKSA-N
Data: 3 IC50
Activity Spreadsheet -- Enzyme Inhibition Constant Data from BindingDB
Found 3 hits for monomerid = 50222730
Trg + Lig
Ki
nM
ΔG°
kcal/mole
IC50
nM
Kd
nM
EC50/IC50
nM
koff
s-1
kon
M-1s-1
pHTemp
°C
Histone deacetylase 6
(Mus musculus)
BDBM50222730
(CHEMBL393464 | cyclo(-L-Am7(S2Py)-L-2MePhe-L-Ala-D...)
Show SMILES C[C@@H]1NC(=O)[C@](C)(Cc2ccccc2)NC(=O)[C@H](CCCCCSSc2ccccn2)NC(=O)[C@H]2CCCN2C1=O
Show InChI InChI=1S/C30H39N5O4S2/c1-21-28(38)35-18-11-15-24(35)27(37)33-23(14-7-4-10-19-40-41-25-16-8-9-17-31-25)26(36)34-30(2,29(39)32-21)20-22-12-5-3-6-13-22/h3,5-6,8-9,12-13,16-17,21,23-24H,4,7,10-11,14-15,18-20H2,1-2H3,(H,32,39)(H,33,37)(H,34,36)/t21-,23-,24+,30-/m0/s1
Reactome pathway
n/an/a 56n/an/an/an/an/an/a
Graduate School of Life Science and Systems Engineering
Curated by ChEMBL
Assay Description
Inhibition of mouse HDAC6 expressed in 293T cells
Bioorg Med Chem 15: 7830-9 (2007)
Article DOI: 10.1016/j.bmc.2007.08.041
BindingDB Entry DOI: 10.7270/Q2BG2NQK
Histone deacetylase 4
(Homo sapiens (Human))
BDBM50222730
(CHEMBL393464 | cyclo(-L-Am7(S2Py)-L-2MePhe-L-Ala-D...)
Show SMILES C[C@@H]1NC(=O)[C@](C)(Cc2ccccc2)NC(=O)[C@H](CCCCCSSc2ccccn2)NC(=O)[C@H]2CCCN2C1=O
Show InChI InChI=1S/C30H39N5O4S2/c1-21-28(38)35-18-11-15-24(35)27(37)33-23(14-7-4-10-19-40-41-25-16-8-9-17-31-25)26(36)34-30(2,29(39)32-21)20-22-12-5-3-6-13-22/h3,5-6,8-9,12-13,16-17,21,23-24H,4,7,10-11,14-15,18-20H2,1-2H3,(H,32,39)(H,33,37)(H,34,36)/t21-,23-,24+,30-/m0/s1
n/an/a 2.20n/an/an/an/an/an/a
Graduate School of Life Science and Systems Engineering
Curated by ChEMBL
Assay Description
Inhibition of human HDAC4 expressed in 293T cells
Bioorg Med Chem 15: 7830-9 (2007)
Article DOI: 10.1016/j.bmc.2007.08.041
BindingDB Entry DOI: 10.7270/Q2BG2NQK
Histone deacetylase 1
(Homo sapiens (Human))
BDBM50222730
(CHEMBL393464 | cyclo(-L-Am7(S2Py)-L-2MePhe-L-Ala-D...)
Show SMILES C[C@@H]1NC(=O)[C@](C)(Cc2ccccc2)NC(=O)[C@H](CCCCCSSc2ccccn2)NC(=O)[C@H]2CCCN2C1=O
Show InChI InChI=1S/C30H39N5O4S2/c1-21-28(38)35-18-11-15-24(35)27(37)33-23(14-7-4-10-19-40-41-25-16-8-9-17-31-25)26(36)34-30(2,29(39)32-21)20-22-12-5-3-6-13-22/h3,5-6,8-9,12-13,16-17,21,23-24H,4,7,10-11,14-15,18-20H2,1-2H3,(H,32,39)(H,33,37)(H,34,36)/t21-,23-,24+,30-/m0/s1
NCI pathway
Reactome pathway
n/an/a 3.70n/an/an/an/an/an/a
Graduate School of Life Science and Systems Engineering
Curated by ChEMBL
Assay Description
Inhibition of human HDAC1 expressed in 293T cells
Bioorg Med Chem 15: 7830-9 (2007)
Article DOI: 10.1016/j.bmc.2007.08.041
BindingDB Entry DOI: 10.7270/Q2BG2NQK