BDBM50222840 3-(cyclopropylmethyl)-N,N,4-trimethyl-2-(3-(trifluoromethyl)benzamido)-2,3-dihydrothiazole-5-carboxamide::CHEMBL248202
SMILES: CN(C)C(=O)c1s\c(=N/C(=O)c2cccc(c2)C(F)(F)F)n(CC2CC2)c1C
InChI Key: InChIKey=OEVHQALCNZSKAN-NKFKGCMQSA-N
Data: 1 IC50
Activity Spreadsheet -- Enzyme Inhibition Constant Data from BindingDB
Found 1 hit for monomerid = 50222840
Trg + Lig
Ki
nM
ΔG°
kcal/mole
IC50
nM
Kd
nM
EC50/IC50
nM
koff
s-1
kon
M-1s-1
pHTemp
°C
Cannabinoid receptor 2
(Homo sapiens (Human))
BDBM50222840
(3-(cyclopropylmethyl)-N,N,4-trimethyl-2-(3-(triflu...)
Show SMILES CN(C)C(=O)c1s\c(=N/C(=O)c2cccc(c2)C(F)(F)F)n(CC2CC2)c1C
Show InChI InChI=1S/C19H20F3N3O2S/c1-11-15(17(27)24(2)3)28-18(25(11)10-12-7-8-12)23-16(26)13-5-4-6-14(9-13)19(20,21)22/h4-6,9,12H,7-8,10H2,1-3H3/b23-18-
Reactome pathway
n/an/a 1.00E+3n/an/an/an/an/an/a
Taisho Pharmaceutical Co. Ltd
Curated by ChEMBL
Assay Description
Displacement of [3H]CP-55940 form human CB2 receptor expressed in CHO cells
Bioorg Med Chem Lett 17: 6299-304 (2007)
Article DOI: 10.1016/j.bmcl.2007.09.004
BindingDB Entry DOI: 10.7270/Q2PG1SJQ