BDBM50222852 CHEMBL248203::N-(5-tert-butyl-3-(cyclopropylmethyl)-4-methylthiazol-2(3H)-ylidene)-4-chloro-3-(trifluoromethyl)benzamide
SMILES: Cc1c(s\c(=N/C(=O)c2ccc(Cl)c(c2)C(F)(F)F)n1CC1CC1)C(C)(C)C
InChI Key: InChIKey=FMJPYKRJGDIQFB-BWAHOGKJSA-N
Data: 1 IC50
Activity Spreadsheet -- Enzyme Inhibition Constant Data from BindingDB
Found 1 hit for monomerid = 50222852
Trg + Lig
Ki
nM
ΔG°
kcal/mole
IC50
nM
Kd
nM
EC50/IC50
nM
koff
s-1
kon
M-1s-1
pHTemp
°C
Cannabinoid receptor 2
(Homo sapiens (Human))
BDBM50222852
(CHEMBL248203 | N-(5-tert-butyl-3-(cyclopropylmethy...)
Show SMILES Cc1c(s\c(=N/C(=O)c2ccc(Cl)c(c2)C(F)(F)F)n1CC1CC1)C(C)(C)C
Show InChI InChI=1S/C20H22ClF3N2OS/c1-11-16(19(2,3)4)28-18(26(11)10-12-5-6-12)25-17(27)13-7-8-15(21)14(9-13)20(22,23)24/h7-9,12H,5-6,10H2,1-4H3/b25-18-
Reactome pathway
n/an/a 230n/an/an/an/an/an/a
Taisho Pharmaceutical Co. Ltd
Curated by ChEMBL
Assay Description
Displacement of [3H]CP-55940 form human CB2 receptor expressed in CHO cells
Bioorg Med Chem Lett 17: 6299-304 (2007)
Article DOI: 10.1016/j.bmcl.2007.09.004
BindingDB Entry DOI: 10.7270/Q2PG1SJQ