BDBM50222856 6-(4-chlorophenyl)-3-{[(3S)-1-isopropylpiperidin-3-yl]methyl}-2-methylquinazolin-4(3H)-one::CHEMBL244936
SMILES: CC(C)N1CCC[C@H](Cn2c(C)nc3ccc(cc3c2=O)-c2ccc(Cl)cc2)C1
InChI Key: InChIKey=ARLXUYKHWSHMLR-SFHVURJKSA-N
Data: 2 KI  1 IC50
Activity Spreadsheet -- Enzyme Inhibition Constant Data from BindingDB
Found 3 hits for monomerid = 50222856
Trg + Lig
Ki
nM
ΔG°
kcal/mole
IC50
nM
Kd
nM
EC50/IC50
nM
koff
s-1
kon
M-1s-1
pHTemp
°C
Ghrelin receptor
(Ovis aries)
BDBM50222856
(6-(4-chlorophenyl)-3-{[(3S)-1-isopropylpiperidin-3...)
Show SMILES CC(C)N1CCC[C@H](Cn2c(C)nc3ccc(cc3c2=O)-c2ccc(Cl)cc2)C1
Show InChI InChI=1S/C24H28ClN3O/c1-16(2)27-12-4-5-18(14-27)15-28-17(3)26-23-11-8-20(13-22(23)24(28)29)19-6-9-21(25)10-7-19/h6-11,13,16,18H,4-5,12,14-15H2,1-3H3/t18-/m0/s1
110n/an/an/an/an/an/an/an/a
Bayer Pharmaceuticals Corporation
Curated by ChEMBL
Assay Description
Displacement of [125I]ghrelin from ovine recombinant GHSR1a expressed in HEK293F cells after 6 hrs by scintillation proximity assay
J Med Chem 50: 5202-16 (2007)
Article DOI: 10.1021/jm070071+
BindingDB Entry DOI: 10.7270/Q2WH2QT2
5-hydroxytryptamine receptor 2C
(Homo sapiens (Human))
BDBM50222856
(6-(4-chlorophenyl)-3-{[(3S)-1-isopropylpiperidin-3...)
Show SMILES CC(C)N1CCC[C@H](Cn2c(C)nc3ccc(cc3c2=O)-c2ccc(Cl)cc2)C1
Show InChI InChI=1S/C24H28ClN3O/c1-16(2)27-12-4-5-18(14-27)15-28-17(3)26-23-11-8-20(13-22(23)24(28)29)19-6-9-21(25)10-7-19/h6-11,13,16,18H,4-5,12,14-15H2,1-3H3/t18-/m0/s1
Reactome pathway
>1.00E+3n/an/an/an/an/an/an/an/a
Bayer Pharmaceuticals Corporation
Curated by ChEMBL
Assay Description
Displacement of [125I]DIO from 5HT2c receptor
J Med Chem 50: 5202-16 (2007)
Article DOI: 10.1021/jm070071+
BindingDB Entry DOI: 10.7270/Q2WH2QT2
Cytochrome P450 2D6
(Homo sapiens (Human))
BDBM50222856
(6-(4-chlorophenyl)-3-{[(3S)-1-isopropylpiperidin-3...)
Show SMILES CC(C)N1CCC[C@H](Cn2c(C)nc3ccc(cc3c2=O)-c2ccc(Cl)cc2)C1
Show InChI InChI=1S/C24H28ClN3O/c1-16(2)27-12-4-5-18(14-27)15-28-17(3)26-23-11-8-20(13-22(23)24(28)29)19-6-9-21(25)10-7-19/h6-11,13,16,18H,4-5,12,14-15H2,1-3H3/t18-/m0/s1
n/an/a 9.60E+3n/an/an/an/an/an/a
Bayer Pharmaceuticals Corporation
Curated by ChEMBL
Assay Description
Inhibition of CYP2D6
J Med Chem 50: 5202-16 (2007)
Article DOI: 10.1021/jm070071+
BindingDB Entry DOI: 10.7270/Q2WH2QT2