BDBM50223416 CHEMBL84395
SMILES: ONC(=O)\C=C\C=C\c1ccccc1
InChI Key: InChIKey=FFBLNIGUJWIHQA-KBXRYBNXSA-N
Data: 1 IC50
Activity Spreadsheet -- Enzyme Inhibition Constant Data from BindingDB
Found 1 hit for monomerid = 50223416
Trg + Lig
Ki
nM
ΔG°
kcal/mole
IC50
nM
Kd
nM
EC50/IC50
nM
koff
s-1
kon
M-1s-1
pHTemp
°C
Histone deacetylase 1/2/3/4/5/6/7/8/9/11/Polyamine deacetylase HDAC10
(Homo sapiens (Human))
BDBM50223416
(CHEMBL84395)
Show SMILES ONC(=O)\C=C\C=C\c1ccccc1
Show InChI InChI=1S/C11H11NO2/c13-11(12-14)9-5-4-8-10-6-2-1-3-7-10/h1-9,14H,(H,12,13)/b8-4+,9-5+
n/an/a 279n/an/an/an/an/an/a
University College London
Curated by ChEMBL
Assay Description
Inhibition of histone deacetylase (HDAC) activity in HeLa cell nuclear extract
Bioorg Med Chem Lett 14: 2477-81 (2004)
BindingDB Entry DOI: 10.7270/Q2S184Q6