BDBM50223434 CHEMBL237501::N-(2,6-dimethoxybenzyl)-5-((R)-2-((R)-2-hydroxy-2-(4-hydroxy-3-(hydroxymethyl)phenyl)ethylamino)propyl)-1H-indole-2-carboxamide
SMILES: COc1cccc(OC)c1CNC(=O)c1cc2cc(C[C@@H](C)NC[C@H](O)c3ccc(O)c(CO)c3)ccc2[nH]1
InChI Key: InChIKey=WTBGOYCHEVMMHF-CLYVBNDRSA-N
Data: 1 EC50
Activity Spreadsheet -- Enzyme Inhibition Constant Data from BindingDB
Found 1 hit for monomerid = 50223434
Trg + Lig
Ki
nM
ΔG°
kcal/mole
IC50
nM
Kd
nM
EC50/IC50
nM
koff
s-1
kon
M-1s-1
pHTemp
°C
Beta-2 adrenergic receptor
(Homo sapiens (Human))
BDBM50223434
(CHEMBL237501 | N-(2,6-dimethoxybenzyl)-5-((R)-2-((...)
Show SMILES COc1cccc(OC)c1CNC(=O)c1cc2cc(C[C@@H](C)NC[C@H](O)c3ccc(O)c(CO)c3)ccc2[nH]1
Show InChI InChI=1S/C30H35N3O6/c1-18(31-16-27(36)20-8-10-26(35)22(13-20)17-34)11-19-7-9-24-21(12-19)14-25(33-24)30(37)32-15-23-28(38-2)5-4-6-29(23)39-3/h4-10,12-14,18,27,31,33-36H,11,15-17H2,1-3H3,(H,32,37)/t18-,27+/m1/s1
Reactome pathway
n/an/an/an/a 0.0580n/an/an/an/a
Pfizer Global Research and Development
Curated by ChEMBL
Assay Description
Agonist activity at human recombinant adrenergic beta-2 receptor expressed in CHO cells assessed as elevation in cAMP levels
Bioorg Med Chem Lett 17: 6188-91 (2007)
Article DOI: 10.1016/j.bmcl.2007.09.031
BindingDB Entry DOI: 10.7270/Q2222VM3