BDBM50223480 6-(2-aminoethyl)-9-(4-(morpholinomethyl)phenyl)benzo[h]isoquinolin-1(2H)-one::CHEMBL249237
SMILES: NCCc1cc2cc[nH]c(=O)c2c2cc(ccc12)-c1ccc(CN2CCOCC2)cc1
InChI Key: InChIKey=BMAVNUDMZFXDBM-UHFFFAOYSA-N
Data: 1 IC50
Activity Spreadsheet -- Enzyme Inhibition Constant Data from BindingDB
Found 1 hit for monomerid = 50223480
Trg + Lig
Ki
nM
ΔG°
kcal/mole
IC50
nM
Kd
nM
EC50/IC50
nM
koff
s-1
kon
M-1s-1
pHTemp
°C
Serine/threonine-protein kinase Chk1
(Homo sapiens (Human))
BDBM50223480
(6-(2-aminoethyl)-9-(4-(morpholinomethyl)phenyl)ben...)
Show SMILES NCCc1cc2cc[nH]c(=O)c2c2cc(ccc12)-c1ccc(CN2CCOCC2)cc1
Show InChI InChI=1S/C26H27N3O2/c27-9-7-21-15-22-8-10-28-26(30)25(22)24-16-20(5-6-23(21)24)19-3-1-18(2-4-19)17-29-11-13-31-14-12-29/h1-6,8,10,15-16H,7,9,11-14,17,27H2,(H,28,30)
Reactome pathway
n/an/a 0.600n/an/an/an/an/an/a
Merck Research Laboratories
Curated by ChEMBL
Assay Description
Inhibition of human Chk1 expressed in baculovirus by time-resolved fluorescence assay
Bioorg Med Chem Lett 17: 6280-5 (2007)
Article DOI: 10.1016/j.bmcl.2007.09.007
BindingDB Entry DOI: 10.7270/Q2W958ZJ