BDBM50223487 9-fluoro-2-phenyl-3,6-dihydro-1,3,6-triaza-cyclopenta[l]phenanthren-7-one::CHEMBL436640
SMILES: Fc1ccc2c3[nH]c(nc3c3cc[nH]c(=O)c3c2c1)-c1ccccc1
InChI Key: InChIKey=RKEVLNISIKYNSD-UHFFFAOYSA-N
Data: 2 IC50
Activity Spreadsheet -- Enzyme Inhibition Constant Data from BindingDB
Found 2 hits for monomerid = 50223487
Trg + Lig
Ki
nM
ΔG°
kcal/mole
IC50
nM
Kd
nM
EC50/IC50
nM
koff
s-1
kon
M-1s-1
pHTemp
°C
Prostaglandin E synthase
(Homo sapiens (Human))
BDBM50223487
(9-fluoro-2-phenyl-3,6-dihydro-1,3,6-triaza-cyclope...)
Show SMILES Fc1ccc2c3[nH]c(nc3c3cc[nH]c(=O)c3c2c1)-c1ccccc1
Show InChI InChI=1S/C20H12FN3O/c21-12-6-7-13-15(10-12)16-14(8-9-22-20(16)25)18-17(13)23-19(24-18)11-4-2-1-3-5-11/h1-10H,(H,22,25)(H,23,24)
Reactome pathway
n/an/a>1.00E+4n/an/an/an/an/an/a
University of Innsbruck
Curated by ChEMBL
Assay Description
Inhibition of mPGES-1 in IL-1beta-stimulated human A549 cell microsomal membranes assessed as reduction in PGE2 formation incubated for 15 mins using...
Bioorg Med Chem 23: 4839-45 (2015)
BindingDB Entry DOI: 10.7270/Q2M90BF8
Serine/threonine-protein kinase Chk1
(Homo sapiens (Human))
BDBM50223487
(9-fluoro-2-phenyl-3,6-dihydro-1,3,6-triaza-cyclope...)
Show SMILES Fc1ccc2c3[nH]c(nc3c3cc[nH]c(=O)c3c2c1)-c1ccccc1
Show InChI InChI=1S/C20H12FN3O/c21-12-6-7-13-15(10-12)16-14(8-9-22-20(16)25)18-17(13)23-19(24-18)11-4-2-1-3-5-11/h1-10H,(H,22,25)(H,23,24)
Reactome pathway
n/an/a 1.08E+3n/an/an/an/an/an/a
Merck Research Laboratories
Curated by ChEMBL
Assay Description
Inhibition of human Chk1 expressed in baculovirus by time-resolved fluorescence assay
Bioorg Med Chem Lett 17: 6280-5 (2007)
Article DOI: 10.1016/j.bmcl.2007.09.007
BindingDB Entry DOI: 10.7270/Q2W958ZJ