BDBM50223488 6-(2-aminoethyl)-9-bromobenzo[h]isoquinolin-1(2H)-one::CHEMBL249796
SMILES: NCCc1cc2cc[nH]c(=O)c2c2cc(Br)ccc12
InChI Key: InChIKey=LKQJSRFIFDDRIE-UHFFFAOYSA-N
Data: 1 IC50
Activity Spreadsheet -- Enzyme Inhibition Constant Data from BindingDB
Found 1 hit for monomerid = 50223488
Trg + Lig
Ki
nM
ΔG°
kcal/mole
IC50
nM
Kd
nM
EC50/IC50
nM
koff
s-1
kon
M-1s-1
pHTemp
°C
Serine/threonine-protein kinase Chk1
(Homo sapiens (Human))
BDBM50223488
(6-(2-aminoethyl)-9-bromobenzo[h]isoquinolin-1(2H)-...)
Show SMILES NCCc1cc2cc[nH]c(=O)c2c2cc(Br)ccc12
Show InChI InChI=1S/C15H13BrN2O/c16-11-1-2-12-9(3-5-17)7-10-4-6-18-15(19)14(10)13(12)8-11/h1-2,4,6-8H,3,5,17H2,(H,18,19)
Reactome pathway
n/an/a 3n/an/an/an/an/an/a
Merck Research Laboratories
Curated by ChEMBL
Assay Description
Inhibition of human Chk1 expressed in baculovirus by time-resolved fluorescence assay
Bioorg Med Chem Lett 17: 6280-5 (2007)
Article DOI: 10.1016/j.bmcl.2007.09.007
BindingDB Entry DOI: 10.7270/Q2W958ZJ