null
SMILES: CCCCCC(CCCCC)c1nc(c[nH]1)-c1ccccc1
InChI Key: InChIKey=XYWGMJFQZHLYDO-UHFFFAOYSA-N
Activity Spreadsheet -- Enzyme Inhibition Constant Data from BindingDB
Found 1 hit for monomerid = 50223723
Trg + Lig
Ki
nM
ΔG°
kcal/mole
IC50
nM
Kd
nM
EC50/IC50
nM
koff
s-1
kon
M-1s-1
pHTemp
°C
Sodium channel protein type 1/2/3 subunit alpha
(Rattus norvegicus)
BDBM50223723
(CHEMBL119494)
Show SMILES CCCCCC(CCCCC)c1nc(c[nH]1)-c1ccccc1
Show InChI InChI=1S/C20H30N2/c1-3-5-8-14-18(15-9-6-4-2)20-21-16-19(22-20)17-12-10-7-11-13-17/h7,10-13,16,18H,3-6,8-9,14-15H2,1-2H3,(H,21,22)
n/an/a 86n/an/an/an/an/an/a
Institut Henri Beaufour
Curated by ChEMBL
Assay Description
Concentration required to inhibit [3H]BTX binding to Sodium channel of rat brain
Bioorg Med Chem Lett 14: 3521-3 (2004)
BindingDB Entry DOI: 10.7270/Q2474D2N