null
SMILES: CCCC(CCC)c1nc(c[nH]1)-c1ccc(cc1)-c1ccccc1
InChI Key: InChIKey=VAJCFLBVVHOAAW-UHFFFAOYSA-N
Activity Spreadsheet -- Enzyme Inhibition Constant Data from BindingDB
Found 1 hit for monomerid = 50223725
Trg + Lig
Ki
nM
ΔG°
kcal/mole
IC50
nM
Kd
nM
EC50/IC50
nM
koff
s-1
kon
M-1s-1
pHTemp
°C
Sodium channel protein type 1/2/3 subunit alpha
(Rattus norvegicus)
BDBM50223725
(CHEMBL118682)
Show SMILES CCCC(CCC)c1nc(c[nH]1)-c1ccc(cc1)-c1ccccc1
Show InChI InChI=1S/C22H26N2/c1-3-8-20(9-4-2)22-23-16-21(24-22)19-14-12-18(13-15-19)17-10-6-5-7-11-17/h5-7,10-16,20H,3-4,8-9H2,1-2H3,(H,23,24)
n/an/a 100n/an/an/an/an/an/a
Institut Henri Beaufour
Curated by ChEMBL
Assay Description
Concentration required to inhibit [3H]BTX binding to Sodium channel of rat brain
Bioorg Med Chem Lett 14: 3521-3 (2004)
BindingDB Entry DOI: 10.7270/Q2474D2N