null
SMILES: CCCC(CCC)c1nc(c[nH]1)-c1ccc(F)cc1
InChI Key: InChIKey=NVKSAJSWRHMINF-UHFFFAOYSA-N
Activity Spreadsheet -- Enzyme Inhibition Constant Data from BindingDB
Found 1 hit for monomerid = 50223728
Trg + Lig
Ki
nM
ΔG°
kcal/mole
IC50
nM
Kd
nM
EC50/IC50
nM
koff
s-1
kon
M-1s-1
pHTemp
°C
Sodium channel protein type 1/2/3 subunit alpha
(Rattus norvegicus)
BDBM50223728
(CHEMBL119103)
Show SMILES CCCC(CCC)c1nc(c[nH]1)-c1ccc(F)cc1
Show InChI InChI=1S/C16H21FN2/c1-3-5-13(6-4-2)16-18-11-15(19-16)12-7-9-14(17)10-8-12/h7-11,13H,3-6H2,1-2H3,(H,18,19)
n/an/a 518n/an/an/an/an/an/a
Institut Henri Beaufour
Curated by ChEMBL
Assay Description
Concentration required to inhibit [3H]BTX binding to Sodium channel of rat brain
Bioorg Med Chem Lett 14: 3521-3 (2004)
BindingDB Entry DOI: 10.7270/Q2474D2N