BDBM50223913 6-((1,3-dioxo-2,8-diazaspiro[4.5]decan-2-yl)methyl)-7-neopentyl-7H-pyrrolo[2,3-d]pyrimidine-2-carbonitrile::7-(2,2-Dimethyl-propyl)-6-(1,3-dioxo-2,8-diaza-spiro[4.5]dec-2-ylmethyl)-7H-pyrrolo[2,3-d] pyrimidine-2-carbonitrile::7-(2,2-dimethyl-propyl)-6-(1,3-dioxo-2,8-diaza-spiro[4.5]dec-2-ylmethyl)-7H-pyrrolo[2,3-d]pyrimidine-2-carbonitrile::CHEMBL249966
SMILES: CC(C)(C)Cn1c(CN2C(=O)CC3(CCNCC3)C2=O)cc2cnc(nc12)C#N
InChI Key: InChIKey=GXGLUMCONRSMLM-UHFFFAOYSA-N
Data: 2 IC50
Activity Spreadsheet -- Enzyme Inhibition Constant Data from BindingDB
Found 2 hits for monomerid = 50223913
Trg + Lig
Ki
nM
ΔG°
kcal/mole
IC50
nM
Kd
nM
EC50/IC50
nM
koff
s-1
kon
M-1s-1
pHTemp
°C
Cathepsin K
(Rattus norvegicus)
BDBM50223913
(6-((1,3-dioxo-2,8-diazaspiro[4.5]decan-2-yl)methyl...)
Show SMILES CC(C)(C)Cn1c(CN2C(=O)CC3(CCNCC3)C2=O)cc2cnc(nc12)C#N
Show InChI InChI=1S/C21H26N6O2/c1-20(2,3)13-27-15(8-14-11-24-16(10-22)25-18(14)27)12-26-17(28)9-21(19(26)29)4-6-23-7-5-21/h8,11,23H,4-7,9,12-13H2,1-3H3
Reactome pathway
n/an/a 30n/an/an/an/an/an/a
Novartis Institutes for BioMedical Research
Curated by ChEMBL
Assay Description
Inhibition of rat recombinant cathepsin K expressed in Sf21 cells by fluorescence assay
J Med Chem 51: 5459-62 (2008)
Article DOI: 10.1021/jm800626a
BindingDB Entry DOI: 10.7270/Q2SF2W0R
Cathepsin S
(Homo sapiens (Human))
BDBM50223913
(6-((1,3-dioxo-2,8-diazaspiro[4.5]decan-2-yl)methyl...)
Show SMILES CC(C)(C)Cn1c(CN2C(=O)CC3(CCNCC3)C2=O)cc2cnc(nc12)C#N
Show InChI InChI=1S/C21H26N6O2/c1-20(2,3)13-27-15(8-14-11-24-16(10-22)25-18(14)27)12-26-17(28)9-21(19(26)29)4-6-23-7-5-21/h8,11,23H,4-7,9,12-13H2,1-3H3
Reactome pathway
n/an/a>1.00E+3n/an/an/an/an/an/a
Novartis Institutes for BioMedical Research
Curated by ChEMBL
Assay Description
Inhibition of cathepsin S by fluorescence assay
Bioorg Med Chem Lett 17: 6096-100 (2007)
Article DOI: 10.1016/j.bmcl.2007.09.047
BindingDB Entry DOI: 10.7270/Q2G160K6