BDBM50223914 6-((4-(4-fluorophenyl)piperazin-1-yl)methyl)-7-neopentyl-7H-pyrrolo[2,3-d]pyrimidine-2-carbonitrile::CHEMBL399054
SMILES: CC(C)(C)Cn1c(CN2CCN(CC2)c2ccc(F)cc2)cc2cnc(nc12)C#N
InChI Key: InChIKey=WUFHENLACZPAJM-UHFFFAOYSA-N
Data: 2 IC50
Activity Spreadsheet -- Enzyme Inhibition Constant Data from BindingDB
Found 2 hits for monomerid = 50223914
Trg + Lig
Ki
nM
ΔG°
kcal/mole
IC50
nM
Kd
nM
EC50/IC50
nM
koff
s-1
kon
M-1s-1
pHTemp
°C
Cathepsin S
(Homo sapiens (Human))
BDBM50223914
(6-((4-(4-fluorophenyl)piperazin-1-yl)methyl)-7-neo...)
Show SMILES CC(C)(C)Cn1c(CN2CCN(CC2)c2ccc(F)cc2)cc2cnc(nc12)C#N
Show InChI InChI=1S/C23H27FN6/c1-23(2,3)16-30-20(12-17-14-26-21(13-25)27-22(17)30)15-28-8-10-29(11-9-28)19-6-4-18(24)5-7-19/h4-7,12,14H,8-11,15-16H2,1-3H3
Reactome pathway
n/an/a>1.00E+3n/an/an/an/an/an/a
Novartis Institutes for BioMedical Research
Curated by ChEMBL
Assay Description
Inhibition of cathepsin S by fluorescence assay
Bioorg Med Chem Lett 17: 6096-100 (2007)
Article DOI: 10.1016/j.bmcl.2007.09.047
BindingDB Entry DOI: 10.7270/Q2G160K6
Cathepsin K
(Homo sapiens (Human))
BDBM50223914
(6-((4-(4-fluorophenyl)piperazin-1-yl)methyl)-7-neo...)
Show SMILES CC(C)(C)Cn1c(CN2CCN(CC2)c2ccc(F)cc2)cc2cnc(nc12)C#N
Show InChI InChI=1S/C23H27FN6/c1-23(2,3)16-30-20(12-17-14-26-21(13-25)27-22(17)30)15-28-8-10-29(11-9-28)19-6-4-18(24)5-7-19/h4-7,12,14H,8-11,15-16H2,1-3H3
Reactome pathway
n/an/a 1n/an/an/an/an/an/a
Novartis Institutes for BioMedical Research
Curated by ChEMBL
Assay Description
Inhibition of cathepsin K by fluorescence assay
Bioorg Med Chem Lett 17: 6096-100 (2007)
Article DOI: 10.1016/j.bmcl.2007.09.047
BindingDB Entry DOI: 10.7270/Q2G160K6