BDBM50223925 6-(4-((4-methylpiperazin-1-yl)methyl)benzyl)-7-cyclohexyl-7H-pyrrolo[2,3-d]pyrimidine-2-carbonitrile::CHEMBL398719
SMILES: CN1CCN(Cc2ccc(Cc3cc4cnc(nc4n3C3CCCCC3)C#N)cc2)CC1
InChI Key: InChIKey=OQXYQZMSUBLQAU-UHFFFAOYSA-N
Data: 2 IC50
Activity Spreadsheet -- Enzyme Inhibition Constant Data from BindingDB
Found 2 hits for monomerid = 50223925
Trg + Lig
Ki
nM
ΔG°
kcal/mole
IC50
nM
Kd
nM
EC50/IC50
nM
koff
s-1
kon
M-1s-1
pHTemp
°C
Cathepsin K
(Homo sapiens (Human))
BDBM50223925
(6-(4-((4-methylpiperazin-1-yl)methyl)benzyl)-7-cyc...)
Show SMILES CN1CCN(Cc2ccc(Cc3cc4cnc(nc4n3C3CCCCC3)C#N)cc2)CC1
Show InChI InChI=1S/C26H32N6/c1-30-11-13-31(14-12-30)19-21-9-7-20(8-10-21)15-24-16-22-18-28-25(17-27)29-26(22)32(24)23-5-3-2-4-6-23/h7-10,16,18,23H,2-6,11-15,19H2,1H3
Reactome pathway
n/an/a 1.5n/an/an/an/an/an/a
Novartis Institutes for BioMedical Research
Curated by ChEMBL
Assay Description
Inhibition of cathepsin K by fluorescence assay
Bioorg Med Chem Lett 17: 6096-100 (2007)
Article DOI: 10.1016/j.bmcl.2007.09.047
BindingDB Entry DOI: 10.7270/Q2G160K6
Cathepsin S
(Homo sapiens (Human))
BDBM50223925
(6-(4-((4-methylpiperazin-1-yl)methyl)benzyl)-7-cyc...)
Show SMILES CN1CCN(Cc2ccc(Cc3cc4cnc(nc4n3C3CCCCC3)C#N)cc2)CC1
Show InChI InChI=1S/C26H32N6/c1-30-11-13-31(14-12-30)19-21-9-7-20(8-10-21)15-24-16-22-18-28-25(17-27)29-26(22)32(24)23-5-3-2-4-6-23/h7-10,16,18,23H,2-6,11-15,19H2,1H3
Reactome pathway
n/an/a 730n/an/an/an/an/an/a
Novartis Institutes for BioMedical Research
Curated by ChEMBL
Assay Description
Inhibition of cathepsin S by fluorescence assay
Bioorg Med Chem Lett 17: 6096-100 (2007)
Article DOI: 10.1016/j.bmcl.2007.09.047
BindingDB Entry DOI: 10.7270/Q2G160K6