BDBM50224043 CHEMBL36229
SMILES: COCCN1C(=O)C(CC(=O)NO)Sc2ccccc12
InChI Key: InChIKey=OFOKZPXQVSKVGW-UHFFFAOYSA-N
Data: 1 IC50
Activity Spreadsheet -- Enzyme Inhibition Constant Data from BindingDB
Found 1 hit for monomerid = 50224043
Trg + Lig
Ki
nM
ΔG°
kcal/mole
IC50
nM
Kd
nM
EC50/IC50
nM
koff
s-1
kon
M-1s-1
pHTemp
°C
Peptide deformylase
(Staphylococcus aureus (strain Mu50 / ATCC 700699))
BDBM50224043
(CHEMBL36229)
Show SMILES COCCN1C(=O)C(CC(=O)NO)Sc2ccccc12
Show InChI InChI=1S/C13H16N2O4S/c1-19-7-6-15-9-4-2-3-5-10(9)20-11(13(15)17)8-12(16)14-18/h2-5,11,18H,6-8H2,1H3,(H,14,16)
n/an/a<5n/an/an/an/an/an/a
Genomics Institute of the Novartis Research Foundation
Curated by ChEMBL
Assay Description
Inhibitory activity towards Ni-peptide deformylase of Staphylococcus aureus
Bioorg Med Chem Lett 14: 1477-81 (2004)
Article DOI: 10.1016/j.bmcl.2004.01.014
BindingDB Entry DOI: 10.7270/Q2MS3S6G