null
SMILES: CN(C1CCCCC1)C(=O)C(C)(C)C1(O)CCN(CCc2ccccc2Cl)CC1
InChI Key: InChIKey=CNIMNQJXZKALLC-UHFFFAOYSA-N
Activity Spreadsheet -- Enzyme Inhibition Constant Data from BindingDB
Found 2 hits for monomerid = 50224333
Trg + Lig
Ki
nM
ΔG°
kcal/mole
IC50
nM
Kd
nM
EC50/IC50
nM
koff
s-1
kon
M-1s-1
pHTemp
°C
Delta-type opioid receptor/Kappa-type opioid receptor/Mu-type opioid receptor/Sigma non-opioid intracellular receptor 1
(Rattus norvegicus (rat)-RAT)
BDBM50224333
(Pipradimadol)
Show SMILES CN(C1CCCCC1)C(=O)C(C)(C)C1(O)CCN(CCc2ccccc2Cl)CC1
Show InChI InChI=1S/C24H37ClN2O2/c1-23(2,22(28)26(3)20-10-5-4-6-11-20)24(29)14-17-27(18-15-24)16-13-19-9-7-8-12-21(19)25/h7-9,12,20,29H,4-6,10-11,13-18H2,1-3H3
Reactome pathway
n/an/a 825n/an/an/an/an/an/a
TBA
Curated by ChEMBL
Assay Description
Inhibition of [3H]naloxone binding to rat brain membrane with 100 mM NaCl.
J Med Chem 26: 42-50 (1983)
BindingDB Entry DOI: 10.7270/Q23X88VD
Delta-type opioid receptor/Kappa-type opioid receptor/Mu-type opioid receptor/Sigma non-opioid intracellular receptor 1
(Rattus norvegicus (rat)-RAT)
BDBM50224333
(Pipradimadol)
Show SMILES CN(C1CCCCC1)C(=O)C(C)(C)C1(O)CCN(CCc2ccccc2Cl)CC1
Show InChI InChI=1S/C24H37ClN2O2/c1-23(2,22(28)26(3)20-10-5-4-6-11-20)24(29)14-17-27(18-15-24)16-13-19-9-7-8-12-21(19)25/h7-9,12,20,29H,4-6,10-11,13-18H2,1-3H3
Reactome pathway
n/an/a 550n/an/an/an/an/an/a
TBA
Curated by ChEMBL
Assay Description
Inhibition of [3H]-Naloxone binding to rat brain membrane without NaCl
J Med Chem 26: 42-50 (1983)
BindingDB Entry DOI: 10.7270/Q23X88VD