BDBM50224406 9-(4-chlorophenyl)-2,3-dihydro-3(R)-methyl-1H-pyrimido[4'',5'':4',5']thieno[3',2':5,6]pyrido[3,4-b][1,4]oxazin-8(9H)-one::CHEMBL241327
SMILES: C[C@@H]1CNc2c(O1)cnc1sc3c(ncn(-c4ccc(Cl)cc4)c3=O)c21
InChI Key: InChIKey=LFUPTQIEOBBAJE-SECBINFHSA-N
Data: 1 KI  2 IC50
Activity Spreadsheet -- Enzyme Inhibition Constant Data from BindingDB
Found 3 hits for monomerid = 50224406
Trg + Lig
Ki
nM
ΔG°
kcal/mole
IC50
nM
Kd
nM
EC50/IC50
nM
koff
s-1
kon
M-1s-1
pHTemp
°C
Metabotropic glutamate receptor
(RAT)
BDBM50224406
(9-(4-chlorophenyl)-2,3-dihydro-3(R)-methyl-1H-pyri...)
Show SMILES C[C@@H]1CNc2c(O1)cnc1sc3c(ncn(-c4ccc(Cl)cc4)c3=O)c21
Show InChI InChI=1S/C18H13ClN4O2S/c1-9-6-20-14-12(25-9)7-21-17-13(14)15-16(26-17)18(24)23(8-22-15)11-4-2-10(19)3-5-11/h2-5,7-9,20H,6H2,1H3/t9-/m1/s1
0.200n/an/an/an/an/an/an/an/a
Schering-Plough Research Institute
Curated by ChEMBL
Assay Description
Displacement of [3H]9-Dimethylamino-3-(4-methoxy-phenyl)-3H-pyrido[3',2':4,5]thieno[3,2-d]pyrimidin-4-one from mGluR1 in rat cerebellum membrane
J Med Chem 50: 5550-3 (2007)
Article DOI: 10.1021/jm070590c
BindingDB Entry DOI: 10.7270/Q2D50MQX
Metabotropic glutamate receptor 5
(Homo sapiens (Human))
BDBM50224406
(9-(4-chlorophenyl)-2,3-dihydro-3(R)-methyl-1H-pyri...)
Show SMILES C[C@@H]1CNc2c(O1)cnc1sc3c(ncn(-c4ccc(Cl)cc4)c3=O)c21
Show InChI InChI=1S/C18H13ClN4O2S/c1-9-6-20-14-12(25-9)7-21-17-13(14)15-16(26-17)18(24)23(8-22-15)11-4-2-10(19)3-5-11/h2-5,7-9,20H,6H2,1H3/t9-/m1/s1
n/an/a>1.00E+3n/an/an/an/an/an/a
Schering-Plough Research Institute
Curated by ChEMBL
Assay Description
Antagonist activity at human mGluR5b expressed in HEK293 cells assessed by measuring intracellular calcium by FLIPR assay
J Med Chem 50: 5550-3 (2007)
Article DOI: 10.1021/jm070590c
BindingDB Entry DOI: 10.7270/Q2D50MQX
Metabotropic glutamate receptor 1
(Homo sapiens (Human))
BDBM50224406
(9-(4-chlorophenyl)-2,3-dihydro-3(R)-methyl-1H-pyri...)
Show SMILES C[C@@H]1CNc2c(O1)cnc1sc3c(ncn(-c4ccc(Cl)cc4)c3=O)c21
Show InChI InChI=1S/C18H13ClN4O2S/c1-9-6-20-14-12(25-9)7-21-17-13(14)15-16(26-17)18(24)23(8-22-15)11-4-2-10(19)3-5-11/h2-5,7-9,20H,6H2,1H3/t9-/m1/s1
n/an/a 1.40n/an/an/an/an/an/a
Schering-Plough Research Institute
Curated by ChEMBL
Assay Description
Antagonist activity at human mGluR1a expressed in CHO cells assessed by measuring intracellular calcium by FLIPR assay
J Med Chem 50: 5550-3 (2007)
Article DOI: 10.1021/jm070590c
BindingDB Entry DOI: 10.7270/Q2D50MQX