BDBM50224496 (S,E)-2-(4-(1H-indol-3-yl)piperidin-1-yl)-2-(1-(3-(3,4,5-trifluorophenyl)acryloyl)piperidin-4-yl)acetic acid::CHEMBL237967
SMILES: OC(=O)[C@H](C1CCN(CC1)C(=O)\C=C\c1cc(F)c(F)c(F)c1)N1CCC(CC1)c1c[nH]c2ccccc12
InChI Key: InChIKey=CJWPNMMSQZADAG-GFPUREGVSA-N
Data: 5 IC50
Activity Spreadsheet -- Enzyme Inhibition Constant Data from BindingDB
Found 5 hits for monomerid = 50224496
Trg + Lig
Ki
nM
ΔG°
kcal/mole
IC50
nM
Kd
nM
EC50/IC50
nM
koff
s-1
kon
M-1s-1
pHTemp
°C
C-C chemokine receptor type 2
(Homo sapiens (Human))
BDBM50224496
((S,E)-2-(4-(1H-indol-3-yl)piperidin-1-yl)-2-(1-(3-...)
Show SMILES OC(=O)[C@H](C1CCN(CC1)C(=O)\C=C\c1cc(F)c(F)c(F)c1)N1CCC(CC1)c1c[nH]c2ccccc12
Show InChI InChI=1S/C29H30F3N3O3/c30-23-15-18(16-24(31)27(23)32)5-6-26(36)34-11-9-20(10-12-34)28(29(37)38)35-13-7-19(8-14-35)22-17-33-25-4-2-1-3-21(22)25/h1-6,15-17,19-20,28,33H,7-14H2,(H,37,38)/b6-5+/t28-/m0/s1
n/an/a 2n/an/an/an/an/an/a
Johnson & Johnson Pharmaceutical Research and Development
Curated by ChEMBL
Assay Description
Antagonist activity at CCR2 expressed in THP1 cells assessed as MCP1-induced calcium flux
J Med Chem 50: 5561-3 (2007)
Article DOI: 10.1021/jm070902b
BindingDB Entry DOI: 10.7270/Q24M948Q
C-C chemokine receptor type 2
(Mus musculus)
BDBM50224496
((S,E)-2-(4-(1H-indol-3-yl)piperidin-1-yl)-2-(1-(3-...)
Show SMILES OC(=O)[C@H](C1CCN(CC1)C(=O)\C=C\c1cc(F)c(F)c(F)c1)N1CCC(CC1)c1c[nH]c2ccccc12
Show InChI InChI=1S/C29H30F3N3O3/c30-23-15-18(16-24(31)27(23)32)5-6-26(36)34-11-9-20(10-12-34)28(29(37)38)35-13-7-19(8-14-35)22-17-33-25-4-2-1-3-21(22)25/h1-6,15-17,19-20,28,33H,7-14H2,(H,37,38)/b6-5+/t28-/m0/s1
Reactome pathway
n/an/a 2.00E+3n/an/an/an/an/an/a
Johnson & Johnson Pharmaceutical Research and Development
Curated by ChEMBL
Assay Description
Displacement of [125I]-mouse MCP1 from CCR2 in mouse peripheral blood monocytes
J Med Chem 50: 5561-3 (2007)
Article DOI: 10.1021/jm070902b
BindingDB Entry DOI: 10.7270/Q24M948Q
C-C chemokine receptor type 2
(Mus musculus)
BDBM50224496
((S,E)-2-(4-(1H-indol-3-yl)piperidin-1-yl)-2-(1-(3-...)
Show SMILES OC(=O)[C@H](C1CCN(CC1)C(=O)\C=C\c1cc(F)c(F)c(F)c1)N1CCC(CC1)c1c[nH]c2ccccc12
Show InChI InChI=1S/C29H30F3N3O3/c30-23-15-18(16-24(31)27(23)32)5-6-26(36)34-11-9-20(10-12-34)28(29(37)38)35-13-7-19(8-14-35)22-17-33-25-4-2-1-3-21(22)25/h1-6,15-17,19-20,28,33H,7-14H2,(H,37,38)/b6-5+/t28-/m0/s1
Reactome pathway
n/an/a 2.00E+3n/an/an/an/an/an/a
Johnson & Johnson Pharmaceutical Research and Development
Curated by ChEMBL
Assay Description
Displacement of [125I]-rat MCP1 from rat CCR2 receptor in monocytes
J Med Chem 50: 5561-3 (2007)
Article DOI: 10.1021/jm070902b
BindingDB Entry DOI: 10.7270/Q24M948Q
C-C chemokine receptor type 2
(Mus musculus)
BDBM50224496
((S,E)-2-(4-(1H-indol-3-yl)piperidin-1-yl)-2-(1-(3-...)
Show SMILES OC(=O)[C@H](C1CCN(CC1)C(=O)\C=C\c1cc(F)c(F)c(F)c1)N1CCC(CC1)c1c[nH]c2ccccc12
Show InChI InChI=1S/C29H30F3N3O3/c30-23-15-18(16-24(31)27(23)32)5-6-26(36)34-11-9-20(10-12-34)28(29(37)38)35-13-7-19(8-14-35)22-17-33-25-4-2-1-3-21(22)25/h1-6,15-17,19-20,28,33H,7-14H2,(H,37,38)/b6-5+/t28-/m0/s1
Reactome pathway
n/an/a 2.00E+3n/an/an/an/an/an/a
Johnson & Johnson Pharmaceutical Research and Development
Curated by ChEMBL
Assay Description
Displacement of [125I]-mouse MCP1 from CCR2 in mouse WEHI265.1 cells
J Med Chem 50: 5561-3 (2007)
Article DOI: 10.1021/jm070902b
BindingDB Entry DOI: 10.7270/Q24M948Q
C-C chemokine receptor type 2
(Homo sapiens (Human))
BDBM50224496
((S,E)-2-(4-(1H-indol-3-yl)piperidin-1-yl)-2-(1-(3-...)
Show SMILES OC(=O)[C@H](C1CCN(CC1)C(=O)\C=C\c1cc(F)c(F)c(F)c1)N1CCC(CC1)c1c[nH]c2ccccc12
Show InChI InChI=1S/C29H30F3N3O3/c30-23-15-18(16-24(31)27(23)32)5-6-26(36)34-11-9-20(10-12-34)28(29(37)38)35-13-7-19(8-14-35)22-17-33-25-4-2-1-3-21(22)25/h1-6,15-17,19-20,28,33H,7-14H2,(H,37,38)/b6-5+/t28-/m0/s1
n/an/a 4n/an/an/an/an/an/a
Johnson & Johnson Pharmaceutical Research and Development
Curated by ChEMBL
Assay Description
Inhibition of human CCR2
J Med Chem 50: 5561-3 (2007)
Article DOI: 10.1021/jm070902b
BindingDB Entry DOI: 10.7270/Q24M948Q