BDBM50224508 (E)-2-(4-(5-hydroxy-1H-indol-3-yl)piperidin-1-yl)-2-(1-(3-(3,4,5-trifluorophenyl)acryloyl)piperidin-4-yl)acetic acid::CHEMBL392097
SMILES: OC(=O)C(C1CCN(CC1)C(=O)\C=C\c1cc(F)c(F)c(F)c1)N1CCC(CC1)c1c[nH]c2ccc(O)cc12
InChI Key: InChIKey=INFSHTAUXWQMBM-DAFODLJHSA-N
Data: 1 IC50
Activity Spreadsheet -- Enzyme Inhibition Constant Data from BindingDB
Found 1 hit for monomerid = 50224508
Trg + Lig
Ki
nM
ΔG°
kcal/mole
IC50
nM
Kd
nM
EC50/IC50
nM
koff
s-1
kon
M-1s-1
pHTemp
°C
C-C chemokine receptor type 2
(Homo sapiens (Human))
BDBM50224508
((E)-2-(4-(5-hydroxy-1H-indol-3-yl)piperidin-1-yl)-...)
Show SMILES OC(=O)C(C1CCN(CC1)C(=O)\C=C\c1cc(F)c(F)c(F)c1)N1CCC(CC1)c1c[nH]c2ccc(O)cc12 |w:3.2|
Show InChI InChI=1S/C29H30F3N3O4/c30-23-13-17(14-24(31)27(23)32)1-4-26(37)34-9-7-19(8-10-34)28(29(38)39)35-11-5-18(6-12-35)22-16-33-25-3-2-20(36)15-21(22)25/h1-4,13-16,18-19,28,33,36H,5-12H2,(H,38,39)/b4-1+
n/an/a 15n/an/an/an/an/an/a
Johnson & Johnson Pharmaceutical Research and Development
Curated by ChEMBL
Assay Description
Inhibition of human CCR2
J Med Chem 50: 5561-3 (2007)
Article DOI: 10.1021/jm070902b
BindingDB Entry DOI: 10.7270/Q24M948Q