BDBM50224552 CHEMBL265726
SMILES: CC(COCC(C)N(CC(O)COc1ccccc1CC=C)CC(O)COc1ccccc1CC=C)OCC(C)OCC(C)N(CC(O)COc1ccccc1CC=C)CC(O)COc1ccccc1CC=C
InChI Key: InChIKey=PFXHNMKRIDQLPW-UHFFFAOYSA-N
Data: 2 Kd
Activity Spreadsheet -- Enzyme Inhibition Constant Data from BindingDB
Found 2 hits for monomerid = 50224552
Trg + Lig
Ki
nM
ΔG°
kcal/mole
IC50
nM
Kd
nM
EC50/IC50
nM
koff
s-1
kon
M-1s-1
pHTemp
°C
Adrenergic receptor beta
(Rattus norvegicus (Rat))
BDBM50224552
(CHEMBL265726)
Show SMILES CC(COCC(C)N(CC(O)COc1ccccc1CC=C)CC(O)COc1ccccc1CC=C)OCC(C)OCC(C)N(CC(O)COc1ccccc1CC=C)CC(O)COc1ccccc1CC=C
Show InChI InChI=1S/C60H84N2O11/c1-9-21-49-25-13-17-29-57(49)70-41-53(63)33-61(34-54(64)42-71-58-30-18-14-26-50(58)22-10-2)45(5)37-67-39-47(7)69-40-48(8)68-38-46(6)62(35-55(65)43-72-59-31-19-15-27-51(59)23-11-3)36-56(66)44-73-60-32-20-16-28-52(60)24-12-4/h9-20,25-32,45-48,53-56,63-66H,1-4,21-24,33-44H2,5-8H3
n/an/an/a>1n/an/an/an/an/a
TBA
Curated by ChEMBL
Assay Description
Binding affinity towards rat beta adrenergic receptor from heart membranes.
J Med Chem 26: 7-11 (1983)
BindingDB Entry DOI: 10.7270/Q20867H8
Adrenergic receptor beta
(Rattus norvegicus (Rat))
BDBM50224552
(CHEMBL265726)
Show SMILES CC(COCC(C)N(CC(O)COc1ccccc1CC=C)CC(O)COc1ccccc1CC=C)OCC(C)OCC(C)N(CC(O)COc1ccccc1CC=C)CC(O)COc1ccccc1CC=C
Show InChI InChI=1S/C60H84N2O11/c1-9-21-49-25-13-17-29-57(49)70-41-53(63)33-61(34-54(64)42-71-58-30-18-14-26-50(58)22-10-2)45(5)37-67-39-47(7)69-40-48(8)68-38-46(6)62(35-55(65)43-72-59-31-19-15-27-51(59)23-11-3)36-56(66)44-73-60-32-20-16-28-52(60)24-12-4/h9-20,25-32,45-48,53-56,63-66H,1-4,21-24,33-44H2,5-8H3
n/an/an/a>1n/an/an/an/an/a
TBA
Curated by ChEMBL
Assay Description
Binding affinity towards rat beta adrenergic receptor from lung membranes.
J Med Chem 26: 7-11 (1983)
BindingDB Entry DOI: 10.7270/Q20867H8