BDBM50224756 3-(2-(4-(dimethylamino)phenyl)-3H-imidazo[4,5-b]pyridin-6-yl)phenol::CHEMBL237361
SMILES: CN(C)c1ccc(cc1)-c1nc2ncc(cc2[nH]1)-c1cccc(O)c1
InChI Key: InChIKey=BLPQAVCUNCMBIR-UHFFFAOYSA-N
Data: 1 IC50
Activity Spreadsheet -- Enzyme Inhibition Constant Data from BindingDB
Found 1 hit for monomerid = 50224756
Trg + Lig
Ki
nM
ΔG°
kcal/mole
IC50
nM
Kd
nM
EC50/IC50
nM
koff
s-1
kon
M-1s-1
pHTemp
°C
Aurora kinase A
(Homo sapiens (Human))
BDBM50224756
(3-(2-(4-(dimethylamino)phenyl)-3H-imidazo[4,5-b]py...)
Show SMILES CN(C)c1ccc(cc1)-c1nc2ncc(cc2[nH]1)-c1cccc(O)c1
Show InChI InChI=1S/C20H18N4O/c1-24(2)16-8-6-13(7-9-16)19-22-18-11-15(12-21-20(18)23-19)14-4-3-5-17(25)10-14/h3-12,25H,1-2H3,(H,21,22,23)
NCI pathway
Reactome pathway
n/an/a 1.80E+4n/an/an/an/an/an/a
Institute of Cancer Research
Curated by ChEMBL
Assay Description
Inhibition of aurora A kinase
Bioorg Med Chem Lett 17: 6567-71 (2007)
Article DOI: 10.1016/j.bmcl.2007.09.076
BindingDB Entry DOI: 10.7270/Q27D2TVT