BDBM50224837 1-(6-{4-[4-(4-fluoro-phenyl)-oxazol-2-yl]-phenoxy}-pyridin-3-yl)-1,7,9-triaza-spiro[4.5]decane-6,8,10-trione::CHEMBL398468
SMILES: Fc1ccc(cc1)-c1coc(n1)-c1ccc(Oc2ccc(cn2)N2CCCC22C(=O)NC(=O)NC2=O)cc1
InChI Key: InChIKey=CLNPMAFVUZNDSG-UHFFFAOYSA-N
Data: 2 IC50
Activity Spreadsheet -- Enzyme Inhibition Constant Data from BindingDB
Found 2 hits for monomerid = 50224837
Trg + Lig
Ki
nM
ΔG°
kcal/mole
IC50
nM
Kd
nM
EC50/IC50
nM
koff
s-1
kon
M-1s-1
pHTemp
°C
Collagenase 3
(Homo sapiens (Human))
BDBM50224837
(1-(6-{4-[4-(4-fluoro-phenyl)-oxazol-2-yl]-phenoxy}...)
Show SMILES Fc1ccc(cc1)-c1coc(n1)-c1ccc(Oc2ccc(cn2)N2CCCC22C(=O)NC(=O)NC2=O)cc1
Show InChI InChI=1S/C27H20FN5O5/c28-18-6-2-16(3-7-18)21-15-37-23(30-21)17-4-9-20(10-5-17)38-22-11-8-19(14-29-22)33-13-1-12-27(33)24(34)31-26(36)32-25(27)35/h2-11,14-15H,1,12-13H2,(H2,31,32,34,35,36)
NCI pathway
Reactome pathway
n/an/a 0.120n/an/an/an/an/an/a
Pfizer Global Research & Development
Curated by ChEMBL
Assay Description
Inhibition of MMP13
Bioorg Med Chem Lett 17: 6529-34 (2007)
Article DOI: 10.1016/j.bmcl.2007.09.085
BindingDB Entry DOI: 10.7270/Q2ZW1KMR
Collagenase 3
(Homo sapiens (Human))
BDBM50224837
(1-(6-{4-[4-(4-fluoro-phenyl)-oxazol-2-yl]-phenoxy}...)
Show SMILES Fc1ccc(cc1)-c1coc(n1)-c1ccc(Oc2ccc(cn2)N2CCCC22C(=O)NC(=O)NC2=O)cc1
Show InChI InChI=1S/C27H20FN5O5/c28-18-6-2-16(3-7-18)21-15-37-23(30-21)17-4-9-20(10-5-17)38-22-11-8-19(14-29-22)33-13-1-12-27(33)24(34)31-26(36)32-25(27)35/h2-11,14-15H,1,12-13H2,(H2,31,32,34,35,36)
NCI pathway
Reactome pathway
n/an/a 12n/an/an/an/an/an/a
Pfizer Global Research & Development
Curated by ChEMBL
Assay Description
Inhibition of MMP13-mediated bovine nasal cartilage degradation assessed as hydroxyprole release
Bioorg Med Chem Lett 17: 6529-34 (2007)
Article DOI: 10.1016/j.bmcl.2007.09.085
BindingDB Entry DOI: 10.7270/Q2ZW1KMR