BDBM50224839 5-(4-(4-(6-chloro-1H-benzo[d]imidazol-2-yl)phenoxy)phenoxy)-5-(2-ethoxyethyl)pyrimidine-2,4,6(1H,3H,5H)-trione::CHEMBL248939
SMILES: CCOCCC1(Oc2ccc(Oc3ccc(cc3)-c3nc4ccc(Cl)cc4[nH]3)cc2)C(=O)NC(=O)NC1=O
InChI Key: InChIKey=APBWJXHEFGHMDV-UHFFFAOYSA-N
Data: 1 IC50
Activity Spreadsheet -- Enzyme Inhibition Constant Data from BindingDB
Found 1 hit for monomerid = 50224839
Trg + Lig
Ki
nM
ΔG°
kcal/mole
IC50
nM
Kd
nM
EC50/IC50
nM
koff
s-1
kon
M-1s-1
pHTemp
°C
Collagenase 3
(Homo sapiens (Human))
BDBM50224839
(5-(4-(4-(6-chloro-1H-benzo[d]imidazol-2-yl)phenoxy...)
Show SMILES CCOCCC1(Oc2ccc(Oc3ccc(cc3)-c3nc4ccc(Cl)cc4[nH]3)cc2)C(=O)NC(=O)NC1=O
Show InChI InChI=1S/C27H23ClN4O6/c1-2-36-14-13-27(24(33)31-26(35)32-25(27)34)38-20-10-8-19(9-11-20)37-18-6-3-16(4-7-18)23-29-21-12-5-17(28)15-22(21)30-23/h3-12,15H,2,13-14H2,1H3,(H,29,30)(H2,31,32,33,34,35)
NCI pathway
Reactome pathway
n/an/a 0.960n/an/an/an/an/an/a
Pfizer Global Research & Development
Curated by ChEMBL
Assay Description
Inhibition of MMP13
Bioorg Med Chem Lett 17: 6529-34 (2007)
Article DOI: 10.1016/j.bmcl.2007.09.085
BindingDB Entry DOI: 10.7270/Q2ZW1KMR