BDBM50224998 2-{4-[1-(4-methyl-benzyl)-piperidin-3-ylmethoxy]-phenyl}-1H-benzoimidazole-5-carboxylic acid amide::CHEMBL250963
SMILES: Cc1ccc(CN2CCCC(COc3ccc(cc3)-c3nc4ccc(cc4[nH]3)C(N)=O)C2)cc1
InChI Key: InChIKey=RDBJTQRXUDHNQX-UHFFFAOYSA-N
Data: 1 IC50
Activity Spreadsheet -- Enzyme Inhibition Constant Data from BindingDB
Found 1 hit for monomerid = 50224998
Trg + Lig
Ki
nM
ΔG°
kcal/mole
IC50
nM
Kd
nM
EC50/IC50
nM
koff
s-1
kon
M-1s-1
pHTemp
°C
Serine/threonine-protein kinase CHK2
(Homo sapiens (Human))
BDBM50224998
(2-{4-[1-(4-methyl-benzyl)-piperidin-3-ylmethoxy]-p...)
Show SMILES Cc1ccc(CN2CCCC(COc3ccc(cc3)-c3nc4ccc(cc4[nH]3)C(N)=O)C2)cc1
Show InChI InChI=1S/C28H30N4O2/c1-19-4-6-20(7-5-19)16-32-14-2-3-21(17-32)18-34-24-11-8-22(9-12-24)28-30-25-13-10-23(27(29)33)15-26(25)31-28/h4-13,15,21H,2-3,14,16-18H2,1H3,(H2,29,33)(H,30,31)
n/an/a 57n/an/an/an/an/an/a
Johnson & Johnson Pharmaceutical Research & Development
Curated by ChEMBL
Assay Description
Inhibition of human recombinant Chk2
Bioorg Med Chem Lett 17: 6467-71 (2007)
Article DOI: 10.1016/j.bmcl.2007.09.098
BindingDB Entry DOI: 10.7270/Q2KP81XB