BDBM50225019 2-(4-((1-benzylpiperidin-4-yl)methoxy)phenyl)-1H-benzo[d]imidazole-5-carboxamide::CHEMBL249959
SMILES: NC(=O)c1ccc2nc([nH]c2c1)-c1ccc(OCC2CCN(Cc3ccccc3)CC2)cc1
InChI Key: InChIKey=LTUJRTNXSJGLBT-UHFFFAOYSA-N
Data: 1 IC50
PDB links: 1 PDB ID matches this monomer.
Activity Spreadsheet -- Enzyme Inhibition Constant Data from BindingDB
Found 1 hit for monomerid = 50225019
Trg + Lig
Ki
nM
ΔG°
kcal/mole
IC50
nM
Kd
nM
EC50/IC50
nM
koff
s-1
kon
M-1s-1
pHTemp
°C
Serine/threonine-protein kinase CHK2
(Homo sapiens (Human))
BDBM50225019
(2-(4-((1-benzylpiperidin-4-yl)methoxy)phenyl)-1H-b...)
Show SMILES NC(=O)c1ccc2nc([nH]c2c1)-c1ccc(OCC2CCN(Cc3ccccc3)CC2)cc1
Show InChI InChI=1S/C27H28N4O2/c28-26(32)22-8-11-24-25(16-22)30-27(29-24)21-6-9-23(10-7-21)33-18-20-12-14-31(15-13-20)17-19-4-2-1-3-5-19/h1-11,16,20H,12-15,17-18H2,(H2,28,32)(H,29,30)
n/an/a 70n/an/an/an/an/an/a
Johnson & Johnson Pharmaceutical Research & Development
Curated by ChEMBL
Assay Description
Inhibition of human recombinant Chk2
Bioorg Med Chem Lett 17: 6467-71 (2007)
Article DOI: 10.1016/j.bmcl.2007.09.098
BindingDB Entry DOI: 10.7270/Q2KP81XB
3D
3D Structure (crystal)