BDBM50225163 (4R)-1-({4-[(2-chloro-5-fluorobenzene)amido]-3-methoxyphenyl}carbonyl)-1,2,3,5-tetrahydrospiro[1-benzazepine-4,1'-cyclopentan]-2'-ene-3'-carboxylic acid::CHEMBL249741
SMILES: COc1cc(ccc1NC(=O)c1cc(F)ccc1Cl)C(=O)N1CC[C@@]2(CCC(=C2)C(O)=O)Cc2ccccc12
InChI Key: InChIKey=ZHFPIMSXEZPRLC-PMERELPUSA-N
Data: 6 IC50
Activity Spreadsheet -- Enzyme Inhibition Constant Data from BindingDB
Found 6 hits for monomerid = 50225163
Trg + Lig
Ki
nM
ΔG°
kcal/mole
IC50
nM
Kd
nM
EC50/IC50
nM
koff
s-1
kon
M-1s-1
pHTemp
°C
Vasopressin V1a receptor
(Homo sapiens (Human))
BDBM50225163
((4R)-1-({4-[(2-chloro-5-fluorobenzene)amido]-3-met...)
Show SMILES COc1cc(ccc1NC(=O)c1cc(F)ccc1Cl)C(=O)N1CC[C@@]2(CCC(=C2)C(O)=O)Cc2ccccc12 |c:29|
Show InChI InChI=1S/C30H26ClFN2O5/c1-39-26-14-18(6-9-24(26)33-27(35)22-15-21(32)7-8-23(22)31)28(36)34-13-12-30(11-10-20(17-30)29(37)38)16-19-4-2-3-5-25(19)34/h2-9,14-15,17H,10-13,16H2,1H3,(H,33,35)(H,37,38)/t30-/m0/s1
n/an/a 38n/an/an/an/an/an/a
Johnson & Johnson Pharmaceutical Research & Development
Curated by ChEMBL
Assay Description
Antagonist activity at human vasopressin V1a receptor expressed in HEK293 cells assessed as inhibition of Arg-vasopressin-induced intracllular calciu...
Bioorg Med Chem Lett 17: 6623-8 (2007)
Article DOI: 10.1016/j.bmcl.2007.09.059
BindingDB Entry DOI: 10.7270/Q2T72H5P
Vasopressin V2 receptor
(Homo sapiens (Human))
BDBM50225163
((4R)-1-({4-[(2-chloro-5-fluorobenzene)amido]-3-met...)
Show SMILES COc1cc(ccc1NC(=O)c1cc(F)ccc1Cl)C(=O)N1CC[C@@]2(CCC(=C2)C(O)=O)Cc2ccccc12 |c:29|
Show InChI InChI=1S/C30H26ClFN2O5/c1-39-26-14-18(6-9-24(26)33-27(35)22-15-21(32)7-8-23(22)31)28(36)34-13-12-30(11-10-20(17-30)29(37)38)16-19-4-2-3-5-25(19)34/h2-9,14-15,17H,10-13,16H2,1H3,(H,33,35)(H,37,38)/t30-/m0/s1
n/an/a 34n/an/an/an/an/an/a
Johnson & Johnson Pharmaceutical Research & Development
Curated by ChEMBL
Assay Description
Displacement of [3H]-Arg-vasopressin from human recombinant vasopressin V2 receptor expressed in HEK293 cells
Bioorg Med Chem Lett 17: 6623-8 (2007)
Article DOI: 10.1016/j.bmcl.2007.09.059
BindingDB Entry DOI: 10.7270/Q2T72H5P
AVPR1A
(RAT)
BDBM50225163
((4R)-1-({4-[(2-chloro-5-fluorobenzene)amido]-3-met...)
Show SMILES COc1cc(ccc1NC(=O)c1cc(F)ccc1Cl)C(=O)N1CC[C@@]2(CCC(=C2)C(O)=O)Cc2ccccc12 |c:29|
Show InChI InChI=1S/C30H26ClFN2O5/c1-39-26-14-18(6-9-24(26)33-27(35)22-15-21(32)7-8-23(22)31)28(36)34-13-12-30(11-10-20(17-30)29(37)38)16-19-4-2-3-5-25(19)34/h2-9,14-15,17H,10-13,16H2,1H3,(H,33,35)(H,37,38)/t30-/m0/s1
n/an/a 640n/an/an/an/an/an/a
Johnson & Johnson Pharmaceutical Research & Development
Curated by ChEMBL
Assay Description
Antagonist activity at rat vasopressin V1a receptor expressed in HEK293 cells assessed as inhibition of Arg-vasopressin-induced intracllular calcium ...
Bioorg Med Chem Lett 17: 6623-8 (2007)
Article DOI: 10.1016/j.bmcl.2007.09.059
BindingDB Entry DOI: 10.7270/Q2T72H5P
Vasopressin V2 Receptor
(Rattus norvegicus (Rat))
BDBM50225163
((4R)-1-({4-[(2-chloro-5-fluorobenzene)amido]-3-met...)
Show SMILES COc1cc(ccc1NC(=O)c1cc(F)ccc1Cl)C(=O)N1CC[C@@]2(CCC(=C2)C(O)=O)Cc2ccccc12 |c:29|
Show InChI InChI=1S/C30H26ClFN2O5/c1-39-26-14-18(6-9-24(26)33-27(35)22-15-21(32)7-8-23(22)31)28(36)34-13-12-30(11-10-20(17-30)29(37)38)16-19-4-2-3-5-25(19)34/h2-9,14-15,17H,10-13,16H2,1H3,(H,33,35)(H,37,38)/t30-/m0/s1
Reactome pathway
n/an/a 30n/an/an/an/an/an/a
Johnson & Johnson Pharmaceutical Research & Development
Curated by ChEMBL
Assay Description
Antagonist activity at rat vasopressin V2 receptor expressed in HEK293 cells assessed as inhibition of Arg-vasopressin-induced cAMP levels
Bioorg Med Chem Lett 17: 6623-8 (2007)
Article DOI: 10.1016/j.bmcl.2007.09.059
BindingDB Entry DOI: 10.7270/Q2T72H5P
Vasopressin V1a receptor
(Homo sapiens (Human))
BDBM50225163
((4R)-1-({4-[(2-chloro-5-fluorobenzene)amido]-3-met...)
Show SMILES COc1cc(ccc1NC(=O)c1cc(F)ccc1Cl)C(=O)N1CC[C@@]2(CCC(=C2)C(O)=O)Cc2ccccc12 |c:29|
Show InChI InChI=1S/C30H26ClFN2O5/c1-39-26-14-18(6-9-24(26)33-27(35)22-15-21(32)7-8-23(22)31)28(36)34-13-12-30(11-10-20(17-30)29(37)38)16-19-4-2-3-5-25(19)34/h2-9,14-15,17H,10-13,16H2,1H3,(H,33,35)(H,37,38)/t30-/m0/s1
n/an/a 5n/an/an/an/an/an/a
Johnson & Johnson Pharmaceutical Research & Development
Curated by ChEMBL
Assay Description
Displacement of [3H]-Arg-vasopressin from human recombinant vasopressin V1a receptor expressed in HEK293 cells
Bioorg Med Chem Lett 17: 6623-8 (2007)
Article DOI: 10.1016/j.bmcl.2007.09.059
BindingDB Entry DOI: 10.7270/Q2T72H5P
Vasopressin V2 receptor
(Homo sapiens (Human))
BDBM50225163
((4R)-1-({4-[(2-chloro-5-fluorobenzene)amido]-3-met...)
Show SMILES COc1cc(ccc1NC(=O)c1cc(F)ccc1Cl)C(=O)N1CC[C@@]2(CCC(=C2)C(O)=O)Cc2ccccc12 |c:29|
Show InChI InChI=1S/C30H26ClFN2O5/c1-39-26-14-18(6-9-24(26)33-27(35)22-15-21(32)7-8-23(22)31)28(36)34-13-12-30(11-10-20(17-30)29(37)38)16-19-4-2-3-5-25(19)34/h2-9,14-15,17H,10-13,16H2,1H3,(H,33,35)(H,37,38)/t30-/m0/s1
n/an/a 52n/an/an/an/an/an/a
Johnson & Johnson Pharmaceutical Research & Development
Curated by ChEMBL
Assay Description
Antagonist activity at human vasopressin V2 receptor expressed in HEK293 cells assessed as inhibition of Arg-vasopressin-induced cAMP levels
Bioorg Med Chem Lett 17: 6623-8 (2007)
Article DOI: 10.1016/j.bmcl.2007.09.059
BindingDB Entry DOI: 10.7270/Q2T72H5P