BDBM50225593 (4-(1-((2-fluoro-4-methoxybenzylamino)methyl)cyclohexyl)piperazin-1-yl)((3R,4S)-4-(4-chlorophenyl)-1-isopropylpyrrolidin-3-yl)methanone::CHEMBL247010
SMILES: COc1ccc(CNCC2(CCCCC2)N2CCN(CC2)C(=O)[C@H]2CN(C[C@@H]2c2ccc(Cl)cc2)C(C)C)c(F)c1
InChI Key: InChIKey=JTBSIVANORDZHN-IHLOFXLRSA-N
Data: 1 KI  1 EC50
Activity Spreadsheet -- Enzyme Inhibition Constant Data from BindingDB
Found 2 hits for monomerid = 50225593
Trg + Lig
Ki
nM
ΔG°
kcal/mole
IC50
nM
Kd
nM
EC50/IC50
nM
koff
s-1
kon
M-1s-1
pHTemp
°C
Melanocortin receptor 4
(Homo sapiens (Human))
BDBM50225593
((4-(1-((2-fluoro-4-methoxybenzylamino)methyl)cyclo...)
Show SMILES COc1ccc(CNCC2(CCCCC2)N2CCN(CC2)C(=O)[C@H]2CN(C[C@@H]2c2ccc(Cl)cc2)C(C)C)c(F)c1
Show InChI InChI=1S/C33H46ClFN4O2/c1-24(2)38-21-29(25-7-10-27(34)11-8-25)30(22-38)32(40)37-15-17-39(18-16-37)33(13-5-4-6-14-33)23-36-20-26-9-12-28(41-3)19-31(26)35/h7-12,19,24,29-30,36H,4-6,13-18,20-23H2,1-3H3/t29-,30+/m1/s1
1.80n/an/an/an/an/an/an/an/a
Neurocrine Biosciences Inc.
Curated by ChEMBL
Assay Description
Displacement of [12]NDPMSH from human MC4R expressed in HEK293 cells
Bioorg Med Chem Lett 17: 6825-31 (2007)
Article DOI: 10.1016/j.bmcl.2007.10.032
BindingDB Entry DOI: 10.7270/Q2862G5Z
Melanocortin receptor 4
(Homo sapiens (Human))
BDBM50225593
((4-(1-((2-fluoro-4-methoxybenzylamino)methyl)cyclo...)
Show SMILES COc1ccc(CNCC2(CCCCC2)N2CCN(CC2)C(=O)[C@H]2CN(C[C@@H]2c2ccc(Cl)cc2)C(C)C)c(F)c1
Show InChI InChI=1S/C33H46ClFN4O2/c1-24(2)38-21-29(25-7-10-27(34)11-8-25)30(22-38)32(40)37-15-17-39(18-16-37)33(13-5-4-6-14-33)23-36-20-26-9-12-28(41-3)19-31(26)35/h7-12,19,24,29-30,36H,4-6,13-18,20-23H2,1-3H3/t29-,30+/m1/s1
n/an/an/an/a 1.60E+3n/an/an/an/a
Neurocrine Biosciences Inc.
Curated by ChEMBL
Assay Description
Agonist activity at MC4R assessed as stimulation of cAMP release
Bioorg Med Chem Lett 17: 6825-31 (2007)
Article DOI: 10.1016/j.bmcl.2007.10.032
BindingDB Entry DOI: 10.7270/Q2862G5Z