BDBM50226009 3-(morpholin-2-yl)phenol::CHEMBL401328
SMILES: Oc1cccc(c1)C1CNCCO1
InChI Key: InChIKey=VYFSCTYDZYUMSC-UHFFFAOYSA-N
Data: 2 EC50
Activity Spreadsheet -- Enzyme Inhibition Constant Data from BindingDB
Found 2 hits for monomerid = 50226009
Trg + Lig
Ki
nM
ΔG°
kcal/mole
IC50
nM
Kd
nM
EC50/IC50
nM
koff
s-1
kon
M-1s-1
pHTemp
°C
D(3) dopamine receptor
(Homo sapiens (Human))
BDBM50226009
(3-(morpholin-2-yl)phenol | CHEMBL401328)
Show SMILES Oc1cccc(c1)C1CNCCO1 |w:7.7|
Show InChI InChI=1S/C10H13NO2/c12-9-3-1-2-8(6-9)10-7-11-4-5-13-10/h1-3,6,10-12H,4-5,7H2
n/an/an/an/a 864n/an/an/an/a
Pfizer Global Research & Development
Curated by ChEMBL
Assay Description
Agonist activity at human recombinant dopamine D3 receptor expressed in CHO cells assessed as inhibition of forskolin-stimulated cAMP accumulation
Bioorg Med Chem Lett 17: 6691-6 (2007)
Article DOI: 10.1016/j.bmcl.2007.10.059
BindingDB Entry DOI: 10.7270/Q23J3CQ5
D(2) dopamine receptor
(Homo sapiens (Human))
BDBM50226009
(3-(morpholin-2-yl)phenol | CHEMBL401328)
Show SMILES Oc1cccc(c1)C1CNCCO1 |w:7.7|
Show InChI InChI=1S/C10H13NO2/c12-9-3-1-2-8(6-9)10-7-11-4-5-13-10/h1-3,6,10-12H,4-5,7H2
Reactome pathway
n/an/an/an/a 7.20E+3n/an/an/an/a
Pfizer Global Research & Development
Curated by ChEMBL
Assay Description
Agonist activity at human recombinant dopamine D2 receptor expressed in rat pituitary cells assessed as inhibition of forskolin-stimulated cAMP accum...
Bioorg Med Chem Lett 17: 6691-6 (2007)
Article DOI: 10.1016/j.bmcl.2007.10.059
BindingDB Entry DOI: 10.7270/Q23J3CQ5