BDBM50226120 CHEMBL398394::N-(2-aminophenyl)-4-((1-oxo-2,3-dihydro-1H-inden-2-yl)methyl)benzamide
SMILES: Nc1ccccc1NC(=O)c1ccc(CC2Cc3ccccc3C2=O)cc1
InChI Key: InChIKey=YFWNJSPBMVKFTH-UHFFFAOYSA-N
Data: 1 IC50
Activity Spreadsheet -- Enzyme Inhibition Constant Data from BindingDB
Found 1 hit for monomerid = 50226120
Trg + Lig
Ki
nM
ΔG°
kcal/mole
IC50
nM
Kd
nM
EC50/IC50
nM
koff
s-1
kon
M-1s-1
pHTemp
°C
Cereblon/Histone deacetylase 1
(Homo sapiens (Human))
BDBM50226120
(CHEMBL398394 | N-(2-aminophenyl)-4-((1-oxo-2,3-dih...)
Show SMILES Nc1ccccc1NC(=O)c1ccc(CC2Cc3ccccc3C2=O)cc1
Show InChI InChI=1S/C23H20N2O2/c24-20-7-3-4-8-21(20)25-23(27)16-11-9-15(10-12-16)13-18-14-17-5-1-2-6-19(17)22(18)26/h1-12,18H,13-14,24H2,(H,25,27)
NCI pathway
Reactome pathway
n/an/a 100n/an/an/an/an/an/a
MethylGene Inc.
Curated by ChEMBL
Assay Description
Inhibition of human recombinant HDAC1 expressed in insect Sf9 cells
Bioorg Med Chem Lett 17: 6729-33 (2007)
Article DOI: 10.1016/j.bmcl.2007.10.050
BindingDB Entry DOI: 10.7270/Q2V124J9