BDBM50226443 6-(2-(1H-indol-6-yl)ethyl)-2-amino-3-methylpyrimidin-4(3H)-one::CHEMBL237891
SMILES: Cn1c(N)nc(CCc2ccc3cc[nH]c3c2)cc1=O
InChI Key: InChIKey=IEVOMHWKXAILLY-UHFFFAOYSA-N
Data: 3 IC50
Activity Spreadsheet -- Enzyme Inhibition Constant Data from BindingDB
Found 3 hits for monomerid = 50226443
Trg + Lig
Ki
nM
ΔG°
kcal/mole
IC50
nM
Kd
nM
EC50/IC50
nM
koff
s-1
kon
M-1s-1
pHTemp
°C
Beta-secretase 1
(Homo sapiens (Human))
BDBM50226443
(6-(2-(1H-indol-6-yl)ethyl)-2-amino-3-methylpyrimid...)
Show SMILES Cn1c(N)nc(CCc2ccc3cc[nH]c3c2)cc1=O
Show InChI InChI=1S/C15H16N4O/c1-19-14(20)9-12(18-15(19)16)5-3-10-2-4-11-6-7-17-13(11)8-10/h2,4,6-9,17H,3,5H2,1H3,(H2,16,18)
n/an/a 1.60E+4n/an/an/an/an/an/a
AstraZeneca Pharmaceuticals LP
Curated by ChEMBL
Assay Description
Inhibition of BACE1 by SPR assay
J Med Chem 50: 5912-25 (2007)
Article DOI: 10.1021/jm070829p
BindingDB Entry DOI: 10.7270/Q2B27V0D
Beta-secretase 1
(Homo sapiens (Human))
BDBM50226443
(6-(2-(1H-indol-6-yl)ethyl)-2-amino-3-methylpyrimid...)
Show SMILES Cn1c(N)nc(CCc2ccc3cc[nH]c3c2)cc1=O
Show InChI InChI=1S/C15H16N4O/c1-19-14(20)9-12(18-15(19)16)5-3-10-2-4-11-6-7-17-13(11)8-10/h2,4,6-9,17H,3,5H2,1H3,(H2,16,18)
n/an/a 4.60E+4n/an/an/an/an/an/a
AstraZeneca Pharmaceuticals LP
Curated by ChEMBL
Assay Description
Inhibition of BACE1 by IGEN assay
J Med Chem 50: 5912-25 (2007)
Article DOI: 10.1021/jm070829p
BindingDB Entry DOI: 10.7270/Q2B27V0D
Beta-secretase 1
(Homo sapiens (Human))
BDBM50226443
(6-(2-(1H-indol-6-yl)ethyl)-2-amino-3-methylpyrimid...)
Show SMILES Cn1c(N)nc(CCc2ccc3cc[nH]c3c2)cc1=O
Show InChI InChI=1S/C15H16N4O/c1-19-14(20)9-12(18-15(19)16)5-3-10-2-4-11-6-7-17-13(11)8-10/h2,4,6-9,17H,3,5H2,1H3,(H2,16,18)
n/an/a 7.70E+4n/an/an/an/an/an/a
AstraZeneca Pharmaceuticals LP
Curated by ChEMBL
Assay Description
Inhibition of BACE1 by FRET assay
J Med Chem 50: 5912-25 (2007)
Article DOI: 10.1021/jm070829p
BindingDB Entry DOI: 10.7270/Q2B27V0D