BDBM50226971 CHEMBL41605
SMILES: CC(C)(Cc1ccc(I)cc1)NCC(O)c1ccc(O)c2nc(O)ccc12
InChI Key: InChIKey=ZTJVIQDVUHZCCL-UHFFFAOYSA-N
Data: 1 IC50
Activity Spreadsheet -- Enzyme Inhibition Constant Data from BindingDB
Found 1 hit for monomerid = 50226971
Trg + Lig
Ki
nM
ΔG°
kcal/mole
IC50
nM
Kd
nM
EC50/IC50
nM
koff
s-1
kon
M-1s-1
pHTemp
°C
Adrenergic receptor beta
(Rattus norvegicus (Rat))
BDBM50226971
(CHEMBL41605)
Show SMILES CC(C)(Cc1ccc(I)cc1)NCC(O)c1ccc(O)c2nc(O)ccc12
Show InChI InChI=1S/C21H23IN2O3/c1-21(2,11-13-3-5-14(22)6-4-13)23-12-18(26)15-7-9-17(25)20-16(15)8-10-19(27)24-20/h3-10,18,23,25-26H,11-12H2,1-2H3,(H,24,27)
n/an/a 7.60n/an/an/an/an/an/a
TBA
Curated by ChEMBL
Assay Description
The compound was evaluated for the inhibition of [125I]cyanopindolol binding to beta adrenergic receptor in rat reticulocyte membrane.
J Med Chem 30: 1563-6 (1987)
BindingDB Entry DOI: 10.7270/Q2HM5BPG