BDBM50227245 CHEMBL3392281
SMILES: CCC(C)OC(=O)C1=C(C)NC(SC)=NC1c1cccc(c1)[N+]([O-])=O
InChI Key: InChIKey=QXXZQMQZGXHZGR-UHFFFAOYSA-N
Data: 1 Kd
Activity Spreadsheet -- Enzyme Inhibition Constant Data from BindingDB
Found 1 hit for monomerid = 50227245
Trg + Lig
Ki
nM
ΔG°
kcal/mole
IC50
nM
Kd
nM
EC50/IC50
nM
koff
s-1
kon
M-1s-1
pHTemp
°C
Voltage-gated calcium channel
(Homo sapiens (Human))
BDBM50227245
(CHEMBL3392281)
Show SMILES CCC(C)OC(=O)C1=C(C)NC(SC)=NC1c1cccc(c1)[N+]([O-])=O |c:7,13|
Show InChI InChI=1S/C17H21N3O4S/c1-5-10(2)24-16(21)14-11(3)18-17(25-4)19-15(14)12-7-6-8-13(9-12)20(22)23/h6-10,15H,5H2,1-4H3,(H,18,19)
n/an/an/a 2.60n/an/an/an/an/a
Princ
Curated by ChEMBL
Assay Description
Inhibition of [3H]nitrendipine binding to L-type calcium channel in guinea pig ventricular myocardium membranes
J Med Chem 33: 1510-5 (1990)
BindingDB Entry DOI: 10.7270/Q2MW2HR0