BDBM50228211 CHEMBL274789
SMILES: Ic1ccc(CN2CCC(CC2)C2(CCC(=O)NC2=O)c2ccccc2)cc1
InChI Key: InChIKey=WJLRTFJPHDSXAF-UHFFFAOYSA-N
Data: 1 IC50
Activity Spreadsheet -- Enzyme Inhibition Constant Data from BindingDB
Found 1 hit for monomerid = 50228211
Trg + Lig
Ki
nM
ΔG°
kcal/mole
IC50
nM
Kd
nM
EC50/IC50
nM
koff
s-1
kon
M-1s-1
pHTemp
°C
Muscarinic acetylcholine receptor
(RAT)
BDBM50228211
(CHEMBL274789)
Show SMILES Ic1ccc(CN2CCC(CC2)C2(CCC(=O)NC2=O)c2ccccc2)cc1
Show InChI InChI=1S/C23H25IN2O2/c24-20-8-6-17(7-9-20)16-26-14-11-19(12-15-26)23(18-4-2-1-3-5-18)13-10-21(27)25-22(23)28/h1-9,19H,10-16H2,(H,25,27,28)
NCI pathway
Reactome pathway
n/an/a 17n/an/an/an/an/an/a
Johns Hopkins Medical Institutions
Curated by ChEMBL
Assay Description
Displacement of [3H]N-methylscopolamine from rat brain homogenate
J Med Chem 32: 1057-62 (1989)
BindingDB Entry DOI: 10.7270/Q29S1T87