BDBM50228212 CHEMBL10086
SMILES: Fc1cccc(CN2CCC(CC2)C2(CCC(=O)NC2=O)c2ccccc2)c1
InChI Key: InChIKey=QVSJHGJPOVSIAV-UHFFFAOYSA-N
Data: 1 IC50
Activity Spreadsheet -- Enzyme Inhibition Constant Data from BindingDB
Found 1 hit for monomerid = 50228212
Trg + Lig
Ki
nM
ΔG°
kcal/mole
IC50
nM
Kd
nM
EC50/IC50
nM
koff
s-1
kon
M-1s-1
pHTemp
°C
Muscarinic acetylcholine receptor
(RAT)
BDBM50228212
(CHEMBL10086)
Show SMILES Fc1cccc(CN2CCC(CC2)C2(CCC(=O)NC2=O)c2ccccc2)c1
Show InChI InChI=1S/C23H25FN2O2/c24-20-8-4-5-17(15-20)16-26-13-10-19(11-14-26)23(18-6-2-1-3-7-18)12-9-21(27)25-22(23)28/h1-8,15,19H,9-14,16H2,(H,25,27,28)
NCI pathway
Reactome pathway
n/an/a 21n/an/an/an/an/an/a
Johns Hopkins Medical Institutions
Curated by ChEMBL
Assay Description
Displacement of [3H]N-methylscopolamine from rat brain homogenate
J Med Chem 32: 1057-62 (1989)
BindingDB Entry DOI: 10.7270/Q29S1T87