BDBM50228271 CHEMBL268506
SMILES: CC[C@H](C)[C@H](NC(=O)[C@H](Cc1ccc(O)cc1)NC(=O)[C@H](CS)NC(=O)[C@H](CCCN=C(N)N)NC(=O)[C@@H](N)CC(O)=O)C(=O)N[C@@H](Cc1c[nH]cn1)C(=O)N1CCC[C@H]1C(=O)N[C@@H](Cc1ccccc1)C(O)=O
InChI Key: InChIKey=CBWPNMDZGLISEC-WDPXEROESA-N
Data: 1 IC50
Activity Spreadsheet -- Enzyme Inhibition Constant Data from BindingDB
Found 1 hit for monomerid = 50228271
Trg + Lig
Ki
nM
ΔG°
kcal/mole
IC50
nM
Kd
nM
EC50/IC50
nM
koff
s-1
kon
M-1s-1
pHTemp
°C
Angiotensin II receptor (AT-1) type-1
(RAT)
BDBM50228271
(CHEMBL268506)
Show SMILES CC[C@H](C)[C@H](NC(=O)[C@H](Cc1ccc(O)cc1)NC(=O)[C@H](CS)NC(=O)[C@H](CCCN=C(N)N)NC(=O)[C@@H](N)CC(O)=O)C(=O)N[C@@H](Cc1c[nH]cn1)C(=O)N1CCC[C@H]1C(=O)N[C@@H](Cc1ccccc1)C(O)=O |wU:63.65,8.8,20.21,2.2,wD:59.62,4.4,46.46,37.38,26.27,(3.98,-9.71,;3.98,-8.48,;5.32,-7.71,;6.38,-8.33,;5.33,-6.17,;3.99,-5.4,;4,-3.86,;5.07,-3.24,;2.66,-3.08,;2.67,-1.54,;1.33,-.77,;1.33,.77,;,1.54,;-1.34,.77,;-2.4,1.39,;-1.34,-.77,;,-1.54,;1.33,-3.86,;1.33,-5.4,;2.4,-6.01,;-.01,-6.17,;-1.34,-5.4,;-2.41,-6.02,;-.01,-7.71,;-1.34,-8.48,;-2.41,-7.86,;-1.34,-10.02,;-.01,-10.79,;-.01,-12.34,;1.32,-13.11,;1.32,-14.65,;2.65,-15.42,;2.65,-16.65,;3.72,-14.81,;-2.68,-10.79,;-2.68,-12.33,;-1.61,-12.95,;-4.01,-13.1,;-5.08,-12.49,;-4.01,-14.64,;-5.34,-15.42,;-6.41,-14.8,;-5.35,-16.65,;6.66,-5.4,;6.67,-4.17,;8,-6.18,;9.33,-5.41,;10.67,-6.18,;10.67,-7.72,;11.91,-8.61,;11.43,-10.08,;9.89,-10.07,;9.42,-8.61,;9.34,-3.87,;8.28,-3.25,;10.68,-3.1,;12.06,-3.75,;13.1,-2.61,;12.34,-1.27,;10.83,-1.58,;9.68,-.56,;9.93,.65,;8.22,-1.04,;7.07,-.01,;5.61,-.49,;4.45,.53,;2.99,.06,;1.84,1.08,;2.16,2.59,;3.62,3.07,;4.77,2.04,;7.38,1.5,;8.55,1.88,;6.46,2.32,)|
Show InChI InChI=1S/C48H67N13O12S/c1-3-26(2)39(45(70)57-34(21-29-23-52-25-54-29)46(71)61-18-8-12-37(61)44(69)58-35(47(72)73)20-27-9-5-4-6-10-27)60-42(67)33(19-28-13-15-30(62)16-14-28)56-43(68)36(24-74)59-41(66)32(11-7-17-53-48(50)51)55-40(65)31(49)22-38(63)64/h4-6,9-10,13-16,23,25-26,31-37,39,62,74H,3,7-8,11-12,17-22,24,49H2,1-2H3,(H,52,54)(H,55,65)(H,56,68)(H,57,70)(H,58,69)(H,59,66)(H,60,67)(H,63,64)(H,72,73)(H4,50,51,53)/t26-,31-,32-,33-,34-,35-,36-,37-,39-/m0/s1
n/an/a 15n/an/an/an/an/an/a
G. D. Searle and Company
Curated by ChEMBL
Assay Description
Concentration required to 50% inhibition in specific binding of [125- I]A-II to Angiotensin II receptor in rat uterine membrane
J Med Chem 33: 1935-40 (1990)
BindingDB Entry DOI: 10.7270/Q2R78D70