BDBM50228574 CHEMBL108582
SMILES: CN(C)CC#CC1CCCCN1C(C)=O
InChI Key: InChIKey=CUYKZCBANJGJGJ-UHFFFAOYSA-N
Data: 1 Kd
Activity Spreadsheet -- Enzyme Inhibition Constant Data from BindingDB
Found 1 hit for monomerid = 50228574
Trg + Lig
Ki
nM
ΔG°
kcal/mole
IC50
nM
Kd
nM
EC50/IC50
nM
koff
s-1
kon
M-1s-1
pHTemp
°C
Muscarinic acetylcholine receptor
(Homo sapiens (Human))
BDBM50228574
(CHEMBL108582)
Show SMILES CN(C)CC#CC1CCCCN1C(C)=O
Show InChI InChI=1S/C12H20N2O/c1-11(15)14-10-5-4-7-12(14)8-6-9-13(2)3/h12H,4-5,7,9-10H2,1-3H3
NCI pathway
Reactome pathway
n/an/an/a 8.30E+3n/an/an/an/an/a
Uppsala University
Curated by ChEMBL
Assay Description
Dissociation constant towards Muscarinic acetylcholine receptor in guinea pig ileum
J Med Chem 33: 3182-9 (1990)
BindingDB Entry DOI: 10.7270/Q2QV3PR1