BDBM50228804 CHEMBL89175
SMILES: CCOC(=O)C1=C(C)N=C(S)N(C1c1cccc(c1)[N+]([O-])=O)S(=O)(=O)c1ccccc1
InChI Key: InChIKey=YKNGHCPXBSRJAV-UHFFFAOYSA-N
Data: 1 IC50
Activity Spreadsheet -- Enzyme Inhibition Constant Data from BindingDB
Found 1 hit for monomerid = 50228804
Trg + Lig
Ki
nM
ΔG°
kcal/mole
IC50
nM
Kd
nM
EC50/IC50
nM
koff
s-1
kon
M-1s-1
pHTemp
°C
Voltage-gated L-type calcium channel
(Homo sapiens (Human))
BDBM50228804
(CHEMBL89175)
Show SMILES CCOC(=O)C1=C(C)N=C(S)N(C1c1cccc(c1)[N+]([O-])=O)S(=O)(=O)c1ccccc1 |c:5,t:8|
Show InChI InChI=1S/C20H19N3O6S2/c1-3-29-19(24)17-13(2)21-20(30)22(31(27,28)16-10-5-4-6-11-16)18(17)14-8-7-9-15(12-14)23(25)26/h4-12,18H,3H2,1-2H3,(H,21,30)
n/an/a 5.20n/an/an/an/an/an/a
Squibb Institute for Medical Research
Curated by ChEMBL
Assay Description
In vitro vasorelaxant activity (voltage-gated calcium channel blocking activity) was determined with potassium-depolarized rabbit thoracic aorta
J Med Chem 33: 2629-35 (1990)
BindingDB Entry DOI: 10.7270/Q2XD13XV