BDBM50228812 CHEMBL315125
SMILES: CCO\C(O)=C1\C(N(C(=O)c2ccc(OC)cc2)C(=S)N=C1C)c1cccc(c1)[N+]([O-])=O
InChI Key: InChIKey=IDBHHAZJRAVAIA-DYTRJAOYSA-N
Data: 1 IC50
Activity Spreadsheet -- Enzyme Inhibition Constant Data from BindingDB
Found 1 hit for monomerid = 50228812
Trg + Lig
Ki
nM
ΔG°
kcal/mole
IC50
nM
Kd
nM
EC50/IC50
nM
koff
s-1
kon
M-1s-1
pHTemp
°C
Voltage-gated L-type calcium channel
(Homo sapiens (Human))
BDBM50228812
(CHEMBL315125)
Show SMILES CCO\C(O)=C1\C(N(C(=O)c2ccc(OC)cc2)C(=S)N=C1C)c1cccc(c1)[N+]([O-])=O |c:21|
Show InChI InChI=1S/C22H21N3O6S/c1-4-31-21(27)18-13(2)23-22(32)24(20(26)14-8-10-17(30-3)11-9-14)19(18)15-6-5-7-16(12-15)25(28)29/h5-12,19,27H,4H2,1-3H3/b21-18+
n/an/a 11n/an/an/an/an/an/a
Squibb Institute for Medical Research
Curated by ChEMBL
Assay Description
In vitro vasorelaxant activity (voltage-gated calcium channel blocking activity) was determined with potassium-depolarized rabbit thoracic aorta
J Med Chem 33: 2629-35 (1990)
BindingDB Entry DOI: 10.7270/Q2XD13XV