BDBM50229029 CHEMBL4065759
SMILES: CCC(C)(C)C(=O)N(C)C(C)c1ccccc1
InChI Key: InChIKey=CWCRVUYFCYDBSD-UHFFFAOYSA-N
Data: 1 EC50
Activity Spreadsheet -- Enzyme Inhibition Constant Data from BindingDB
Found 1 hit for monomerid = 50229029
Trg + Lig
Ki
nM
ΔG°
kcal/mole
IC50
nM
Kd
nM
EC50/IC50
nM
koff
s-1
kon
M-1s-1
pHTemp
°C
Receptor-interacting serine/threonine-protein kinase 1
(Homo sapiens (Human))
BDBM50229029
(CHEMBL4065759)
Show SMILES CCC(C)(C)C(=O)N(C)C(C)c1ccccc1
Show InChI InChI=1S/C15H23NO/c1-6-15(3,4)14(17)16(5)12(2)13-10-8-7-9-11-13/h7-12H,6H2,1-5H3
n/an/an/an/a>1.00E+4n/an/an/an/a
National Institute of Biological Sciences
Curated by ChEMBL
Assay Description
Inhibition of RIP1 in human HT-29 cells assessed as reduction in TNFalpha/z-VAD-FMK-induced necrosis after 24 hrs by Cell Titer-Glo luminescent cell ...
J Med Chem 60: 972-986 (2017)
BindingDB Entry DOI: 10.7270/Q2QC05QD