BDBM50229378 (R)-N-(1-(3-(4-cyanophenyl)H-imidazo[1,2-a]pyridin-2-yl)ethyl)-N-(2-(ethylsulfonyl)ethyl)-2-(4-fluoro-3-(trifluoromethyl)phenyl)acetamide::CHEMBL398941
SMILES: CCS(=O)(=O)CCN([C@H](C)c1nc2ccccn2c1-c1ccc(cc1)C#N)C(=O)Cc1ccc(F)c(c1)C(F)(F)F
InChI Key: InChIKey=CRLTWFPBUDXVON-LJQANCHMSA-N
Data: 1 KI  2 IC50
Activity Spreadsheet -- Enzyme Inhibition Constant Data from BindingDB
Found 3 hits for monomerid = 50229378
Trg + Lig
Ki
nM
ΔG°
kcal/mole
IC50
nM
Kd
nM
EC50/IC50
nM
koff
s-1
kon
M-1s-1
pHTemp
°C
chemokine (C-X-C motif) receptor 3
(Homo sapiens (Human))
BDBM50229378
((R)-N-(1-(3-(4-cyanophenyl)H-imidazo[1,2-a]pyridin...)
Show SMILES CCS(=O)(=O)CCN([C@H](C)c1nc2ccccn2c1-c1ccc(cc1)C#N)C(=O)Cc1ccc(F)c(c1)C(F)(F)F
Show InChI InChI=1S/C29H26F4N4O3S/c1-3-41(39,40)15-14-36(26(38)17-21-9-12-24(30)23(16-21)29(31,32)33)19(2)27-28(22-10-7-20(18-34)8-11-22)37-13-5-4-6-25(37)35-27/h4-13,16,19H,3,14-15,17H2,1-2H3/t19-/m1/s1
3n/an/an/an/an/an/an/an/a
Amgen Inc.
Curated by ChEMBL
Assay Description
Displacement of [125I]-IP-10 from CXCR3 receptor expressed in human PBMC in RPMI-1640 buffer supplemented with 0.5% BSA
Bioorg Med Chem Lett 18: 688-93 (2008)
Article DOI: 10.1016/j.bmcl.2007.11.060
BindingDB Entry DOI: 10.7270/Q2WQ03HW
chemokine (C-X-C motif) receptor 3
(Homo sapiens (Human))
BDBM50229378
((R)-N-(1-(3-(4-cyanophenyl)H-imidazo[1,2-a]pyridin...)
Show SMILES CCS(=O)(=O)CCN([C@H](C)c1nc2ccccn2c1-c1ccc(cc1)C#N)C(=O)Cc1ccc(F)c(c1)C(F)(F)F
Show InChI InChI=1S/C29H26F4N4O3S/c1-3-41(39,40)15-14-36(26(38)17-21-9-12-24(30)23(16-21)29(31,32)33)19(2)27-28(22-10-7-20(18-34)8-11-22)37-13-5-4-6-25(37)35-27/h4-13,16,19H,3,14-15,17H2,1-2H3/t19-/m1/s1
n/an/a 21n/an/an/an/an/an/a
Amgen Inc.
Curated by ChEMBL
Assay Description
Displacement of [125I]-IP-10 from CXCR3 receptor expressed in human PBMC in EDTA-anti-coagulated human plasma
Bioorg Med Chem Lett 18: 688-93 (2008)
Article DOI: 10.1016/j.bmcl.2007.11.060
BindingDB Entry DOI: 10.7270/Q2WQ03HW
chemokine (C-X-C motif) receptor 3
(Homo sapiens (Human))
BDBM50229378
((R)-N-(1-(3-(4-cyanophenyl)H-imidazo[1,2-a]pyridin...)
Show SMILES CCS(=O)(=O)CCN([C@H](C)c1nc2ccccn2c1-c1ccc(cc1)C#N)C(=O)Cc1ccc(F)c(c1)C(F)(F)F
Show InChI InChI=1S/C29H26F4N4O3S/c1-3-41(39,40)15-14-36(26(38)17-21-9-12-24(30)23(16-21)29(31,32)33)19(2)27-28(22-10-7-20(18-34)8-11-22)37-13-5-4-6-25(37)35-27/h4-13,16,19H,3,14-15,17H2,1-2H3/t19-/m1/s1
n/an/a 72n/an/an/an/an/an/a
Amgen Inc.
Curated by ChEMBL
Assay Description
Antagonist activity at CXCR3 assessed as ITAC-mediated migration of human PBMC in presence of 100% human plasma
Bioorg Med Chem Lett 18: 688-93 (2008)
Article DOI: 10.1016/j.bmcl.2007.11.060
BindingDB Entry DOI: 10.7270/Q2WQ03HW