BDBM50229510 CHEMBL4073564
SMILES: CN(Cc1cc(F)cc(F)c1F)C(=O)C(C)(C)CO
InChI Key: InChIKey=QNXSMTQXYGWZRD-UHFFFAOYSA-N
Data: 1 EC50
Activity Spreadsheet -- Enzyme Inhibition Constant Data from BindingDB
Found 1 hit for monomerid = 50229510
Trg + Lig
Ki
nM
ΔG°
kcal/mole
IC50
nM
Kd
nM
EC50/IC50
nM
koff
s-1
kon
M-1s-1
pHTemp
°C
Receptor-interacting serine/threonine-protein kinase 1
(Homo sapiens (Human))
BDBM50229510
(CHEMBL4073564)
Show SMILES CN(Cc1cc(F)cc(F)c1F)C(=O)C(C)(C)CO
Show InChI InChI=1S/C13H16F3NO2/c1-13(2,7-18)12(19)17(3)6-8-4-9(14)5-10(15)11(8)16/h4-5,18H,6-7H2,1-3H3
n/an/an/an/a>3.00E+3n/an/an/an/a
National Institute of Biological Sciences
Curated by ChEMBL
Assay Description
Inhibition of RIP1 in human HT-29 cells assessed as reduction in TNFalpha/z-VAD-FMK-induced necrosis after 24 hrs by Cell Titer-Glo luminescent cell ...
J Med Chem 60: 972-986 (2017)
BindingDB Entry DOI: 10.7270/Q2QC05QD