BDBM50229692 CHEMBL311562
SMILES: Cc1ncn(n1)C12CCN(C1)CCC2
InChI Key: InChIKey=CLWFPRVOBCWLCZ-UHFFFAOYSA-N
Data: 2 IC50
Activity Spreadsheet -- Enzyme Inhibition Constant Data from BindingDB
Found 2 hits for monomerid = 50229692
Trg + Lig
Ki
nM
ΔG°
kcal/mole
IC50
nM
Kd
nM
EC50/IC50
nM
koff
s-1
kon
M-1s-1
pHTemp
°C
Muscarinic acetylcholine receptor
(RAT)
BDBM50229692
(CHEMBL311562)
Show SMILES Cc1ncn(n1)C12CCN(C1)CCC2
Show InChI InChI=1S/C10H16N4/c1-9-11-8-14(12-9)10-3-2-5-13(7-10)6-4-10/h8H,2-7H2,1H3
NCI pathway
Reactome pathway
n/an/a 2.10E+3n/an/an/an/an/an/a
SmithKline Beecham Pharmaceuticals
Curated by ChEMBL
Assay Description
In vitro displacement of [3H]quinuclidinyl benzilate (QNB) from rat cerebral cortex muscarinic receptor.
J Med Chem 35: 2392-406 (1992)
BindingDB Entry DOI: 10.7270/Q2TF00K5
Muscarinic acetylcholine receptor
(RAT)
BDBM50229692
(CHEMBL311562)
Show SMILES Cc1ncn(n1)C12CCN(C1)CCC2
Show InChI InChI=1S/C10H16N4/c1-9-11-8-14(12-9)10-3-2-5-13(7-10)6-4-10/h8H,2-7H2,1H3
NCI pathway
Reactome pathway
n/an/a 12n/an/an/an/an/an/a
SmithKline Beecham Pharmaceuticals
Curated by ChEMBL
Assay Description
In vitro ability to displace [3H]oxotremorine-M (OXO-M) from rat cerebral cortex muscarinic receptor.
J Med Chem 35: 2392-406 (1992)
BindingDB Entry DOI: 10.7270/Q2TF00K5