BDBM50229699 CHEMBL4059584
SMILES: CCC(C)(C)C(=O)N(C)Cc1ccccc1F
InChI Key: InChIKey=LYPDEADXVSVYJI-UHFFFAOYSA-N
Data: 1 EC50
Activity Spreadsheet -- Enzyme Inhibition Constant Data from BindingDB
Found 1 hit for monomerid = 50229699
Trg + Lig
Ki
nM
ΔG°
kcal/mole
IC50
nM
Kd
nM
EC50/IC50
nM
koff
s-1
kon
M-1s-1
pHTemp
°C
Receptor-interacting serine/threonine-protein kinase 1
(Homo sapiens (Human))
BDBM50229699
(CHEMBL4059584)
Show SMILES CCC(C)(C)C(=O)N(C)Cc1ccccc1F
Show InChI InChI=1S/C14H20FNO/c1-5-14(2,3)13(17)16(4)10-11-8-6-7-9-12(11)15/h6-9H,5,10H2,1-4H3
n/an/an/an/a 125n/an/an/an/a
National Institute of Biological Sciences
Curated by ChEMBL
Assay Description
Inhibition of RIP1 in human HT-29 cells assessed as reduction in TNFalpha/z-VAD-FMK-induced necrosis after 24 hrs by Cell Titer-Glo luminescent cell ...
J Med Chem 60: 972-986 (2017)
BindingDB Entry DOI: 10.7270/Q2QC05QD