BDBM50229704 CHEMBL4078215
SMILES: CCC(C)(C)C(=O)N(C)Cc1ccncc1F
InChI Key: InChIKey=JCIHRPYRKCGZPW-UHFFFAOYSA-N
Data: 1 EC50
Activity Spreadsheet -- Enzyme Inhibition Constant Data from BindingDB
Found 1 hit for monomerid = 50229704
Trg + Lig
Ki
nM
ΔG°
kcal/mole
IC50
nM
Kd
nM
EC50/IC50
nM
koff
s-1
kon
M-1s-1
pHTemp
°C
Receptor-interacting serine/threonine-protein kinase 1
(Homo sapiens (Human))
BDBM50229704
(CHEMBL4078215)
Show SMILES CCC(C)(C)C(=O)N(C)Cc1ccncc1F
Show InChI InChI=1S/C13H19FN2O/c1-5-13(2,3)12(17)16(4)9-10-6-7-15-8-11(10)14/h6-8H,5,9H2,1-4H3
n/an/an/an/a>1.00E+4n/an/an/an/a
National Institute of Biological Sciences
Curated by ChEMBL
Assay Description
Inhibition of RIP1 in human HT-29 cells assessed as reduction in TNFalpha/z-VAD-FMK-induced necrosis after 24 hrs by Cell Titer-Glo luminescent cell ...
J Med Chem 60: 972-986 (2017)
BindingDB Entry DOI: 10.7270/Q2QC05QD