BDBM50229709 CHEMBL4090855
SMILES: C1CC2=C(CNC(=N2)c2ccccc2)CO1
InChI Key: InChIKey=QWIUSPCOIFKTPW-UHFFFAOYSA-N
Data: 1 IC50
Activity Spreadsheet -- Enzyme Inhibition Constant Data from BindingDB
Found 1 hit for monomerid = 50229709
Trg + Lig
Ki
nM
ΔG°
kcal/mole
IC50
nM
Kd
nM
EC50/IC50
nM
koff
s-1
kon
M-1s-1
pHTemp
°C
Poly [ADP-ribose] polymerase tankyrase-2
(Homo sapiens (Human))
BDBM50229709
(CHEMBL4090855)
Show SMILES C1CC2=C(CNC(=N2)c2ccccc2)CO1 |c:6,t:2|
Show InChI InChI=1S/C13H14N2O/c1-2-4-10(5-3-1)13-14-8-11-9-16-7-6-12(11)15-13/h1-5H,6-9H2,(H,14,15)
n/an/a 200n/an/an/an/an/an/a
Rheinische Friedrich-Wilhelms-Universit£t
Curated by ChEMBL
Assay Description
Inhibition of tankyrase-2 (unknown origin)
J Med Chem 60: 1238-1246 (2017)
BindingDB Entry DOI: 10.7270/Q2KK9F10