BDBM50229834 CHEMBL328270
SMILES: COC(=O)CCCCC(=O)Nc1nnc(s1)S(N)(=O)=O
InChI Key: InChIKey=YEJYELPTGWIRAK-UHFFFAOYSA-N
Data: 1 IC50
Activity Spreadsheet -- Enzyme Inhibition Constant Data from BindingDB
Found 1 hit for monomerid = 50229834
Trg + Lig
Ki
nM
ΔG°
kcal/mole
IC50
nM
Kd
nM
EC50/IC50
nM
koff
s-1
kon
M-1s-1
pHTemp
°C
Carbonic anhydrase
(Homo sapiens (Human))
BDBM50229834
(CHEMBL328270)
Show SMILES COC(=O)CCCCC(=O)Nc1nnc(s1)S(N)(=O)=O
Show InChI InChI=1S/C9H14N4O5S2/c1-18-7(15)5-3-2-4-6(14)11-8-12-13-9(19-8)20(10,16)17/h2-5H2,1H3,(H2,10,16,17)(H,11,12,14)
n/an/a 230n/an/an/an/an/an/a
Istituto Chimico Internazionale Dr. G. Rende
Curated by ChEMBL
Assay Description
Inhibition of Carbonic anhydrase enzyme in rabbits
J Med Chem 35: 2697-703 (1992)
BindingDB Entry DOI: 10.7270/Q2K076G9