BDBM50229843 CHEMBL91131
SMILES: CCOC(=O)CCC(=O)Nc1nnc(s1)S(N)(=O)=O
InChI Key: InChIKey=VBKUNDBTMBRMAA-UHFFFAOYSA-N
Data: 1 IC50
Activity Spreadsheet -- Enzyme Inhibition Constant Data from BindingDB
Found 1 hit for monomerid = 50229843
Trg + Lig
Ki
nM
ΔG°
kcal/mole
IC50
nM
Kd
nM
EC50/IC50
nM
koff
s-1
kon
M-1s-1
pHTemp
°C
Carbonic anhydrase
(Homo sapiens (Human))
BDBM50229843
(CHEMBL91131)
Show SMILES CCOC(=O)CCC(=O)Nc1nnc(s1)S(N)(=O)=O
Show InChI InChI=1S/C8H12N4O5S2/c1-2-17-6(14)4-3-5(13)10-7-11-12-8(18-7)19(9,15)16/h2-4H2,1H3,(H2,9,15,16)(H,10,11,13)
n/an/a 730n/an/an/an/an/an/a
Istituto Chimico Internazionale Dr. G. Rende
Curated by ChEMBL
Assay Description
Inhibition of Carbonic anhydrase enzyme in rabbits
J Med Chem 35: 2697-703 (1992)
BindingDB Entry DOI: 10.7270/Q2K076G9