BDBM50229846 CHEMBL264307
SMILES: NS(=O)(=O)c1nnc(NC(=O)CCCCCCCC(O)=O)s1
InChI Key: InChIKey=MXZHXVQAZIDJKM-UHFFFAOYSA-N
Data: 1 IC50
Activity Spreadsheet -- Enzyme Inhibition Constant Data from BindingDB
Found 1 hit for monomerid = 50229846
Trg + Lig
Ki
nM
ΔG°
kcal/mole
IC50
nM
Kd
nM
EC50/IC50
nM
koff
s-1
kon
M-1s-1
pHTemp
°C
Carbonic anhydrase
(Homo sapiens (Human))
BDBM50229846
(CHEMBL264307)
Show SMILES NS(=O)(=O)c1nnc(NC(=O)CCCCCCCC(O)=O)s1
Show InChI InChI=1S/C11H18N4O5S2/c12-22(19,20)11-15-14-10(21-11)13-8(16)6-4-2-1-3-5-7-9(17)18/h1-7H2,(H,17,18)(H2,12,19,20)(H,13,14,16)
n/an/a 480n/an/an/an/an/an/a
Istituto Chimico Internazionale Dr. G. Rende
Curated by ChEMBL
Assay Description
Inhibition of Carbonic anhydrase enzyme in rabbits
J Med Chem 35: 2697-703 (1992)
BindingDB Entry DOI: 10.7270/Q2K076G9